{"text_format":"1","workbook":"xlsx","n_sheets":11,"sheets":["Introduction","GenericProjects","CommercialProjects","Control Panel","Results","SupplyCurve","NewTx","ExistingTx","CommProjRanks","ResourceRanks","SupplyCurveChart"],"not_rendered":{"charts":2,"images":0,"macros":1,"external_links":2,"defined_names":3087,"comments":0,"pivot_tables":0},"unopened":[{"sheet":"SupplyCurveChart","index":10,"reason":"not_a_worksheet"}],"bounds":{"document_bytes":16777216,"sheet_cells":100000,"rows_first":2000,"rows_last":500,"rows_between":2000,"halvings":0,"cell_chars":16384,"cell_head_chars":4096},"cells_cut":0,"cells_raw":0,"read":"whole","date_system":"1900"}

{"sheet":"Introduction","index":0,"n_rows":11,"n_cols":1,"rows_kept":11,"cut":false,"hidden":false,"merged":[]}
["CPUC 33% Renewable Portfolio Standard (RPS) Implementation Analysis Tool"]
["Output Module"]
[]
["This workbook allows model users to see a resource-by-resource breakdown of what the model selects to meet the RES in California under the given scenario."]
["The 'GenericProjects' and 'CommercialProjects' sheets list all resources available for selection in the model, and identify which of those resources were selected for delivery by each delivery method."]
["The 'SupplyCurveChart' sheet builds up a supply curve like those presented in the June 18th workship at the CPUC."]
[]
["This output module must be located in the same (unzipped) folder as the model to work."]
["Please do not change any of the formulae or sheet names in this template.  Doing so may prohibit the proper functioning of the output module."]
["Please ensure that macros are enabled in this workbook to ensure the proper functioning of the output module."]
["This workbook is read-only.  If you would like to save the results, please save them under a new name."]

{"sheet":"GenericProjects","index":1,"n_rows":7,"n_cols":53,"rows_kept":7,"cut":false,"hidden":false,"merged":[[3,0,3,1],[4,44,4,52],[4,0,4,10],[4,29,4,43],[4,20,4,28],[4,11,4,19]]}
["Generic Projects to meet the California RES (from RETI, WREZ, the E3 GHG Calculator, and the B&V/E3 analysis of distributed solar potential)"]
["Projects"]
[]
["Instructions: To determine the capacity (MW) or energy (MWh) a project contributes to the case by type of delivery, multiply the project's capacity or energy (columns H & I) by the project's selected fraction for that delivery method (columns M, V, AH, and AT)",null,null,null," "]
["Project Information",null,null,null,null,null,null,null,null,null,null,"For Delivery over Existing Transmission",null,null,null,null,null,null,null,null,"For Delivery over Minor Upgrades",null,null,null,null,null,null,null,null,"For Delivery over New Transmission",null,null,null,null,null,null,null,null,null,null,null,null,null,null,"For Delivery as Out-of-State REC"]
["ID#","Project ID","Zone","Region","Type","Sub-Type","Location for Resource Type","Capacity (MW)","Energy (GWh)","Discounted Core","Commercial Project","Available","Selected","Net Cost","Cost Score","Environmental Score","Commercial Interest Score","Timing Score","Weighted Score","Year Available","Available","Selected","Net Cost","Cost Score","Environmental Score","Commercial Interest Score","Timing Score","Bundle Score","Year Available","Available - Segment 1","Available - Segment 2","Available - Segment 3","Available - Segment 4","Selected","Net Cost","Cost Score","Environmental Score","Commercial Interest Score","Timing Score (New Transmission)","Weighted Score (New Transmission)","Year Available (Segment 1)","Year Available (Segment 2)","Year Available (Segment 3)","Year Available (Segment 4)","Available","Selected","Net Cost","Cost Score","Environmental Score","Commercial Interest Score","Timing Score","Weighted Score","Year Available"]
[{"$f":"ROW()-ROW($A$6)","v":1},{"$f":"OFFSET(ResourceRanks!$B$1,$A7,0)","v":0},{"$f":"OFFSET(ResourceRanks!$H$1,$A7,0)","v":0},{"$f":"OFFSET(ResourceRanks!$K$1,$A7,0)","v":0},{"$f":"OFFSET(ResourceRanks!$D$1,$A7,0)","v":0},{"$f":"OFFSET(ResourceRanks!$E$1,$A7,0)","v":0},{"$f":"OFFSET(ResourceRanks!$F$1,$A7,0)","v":0},{"$f":"OFFSET(ResourceRanks!$P$1,$A7,0)","v":0},{"$f":"OFFSET(ResourceRanks!$S$1,$A7,0)","v":0},0,0,{"$f":"SUM(IF(IF(SupplyCurve!$D$5:$D$3004=\"Existing Tx\",SupplyCurve!$G$5:$G$3004,FALSE)=$A7,SupplyCurve!$X$5:$X$3004,0))/$I7","v":{"$error":"#DIV/0!"}},{"$f":"SUM(IF(IF(SupplyCurve!$D$5:$D$3004=\"Existing Tx\",SupplyCurve!$G$5:$G$3004,FALSE)=$A7,SupplyCurve!$BN$5:$BN$3004,0))/$I7","v":{"$error":"#DIV/0!"}},{"$f":"IF($L7=0,\"n/a\",OFFSET(ExistingTx!$DG$5,MATCH($A7,ExistingTx!$C$6:$C$3005,0),0))","v":{"$error":"#DIV/0!"}},{"$f":"IF($L7=0,\"n/a\",OFFSET(ExistingTx!$DI$5,MATCH($A7,ExistingTx!$C$6:$C$3005,0),0))","v":{"$error":"#DIV/0!"}},{"$f":"IF($L7=0,\"n/a\",OFFSET(ExistingTx!$DJ$5,MATCH($A7,ExistingTx!$C$6:$C$3005,0),0))","v":{"$error":"#DIV/0!"}},{"$f":"IF($L7=0,\"n/a\",OFFSET(ExistingTx!$DL$5,MATCH($A7,ExistingTx!$C$6:$C$3005,0),0))","v":{"$error":"#DIV/0!"}},{"$f":"IF($L7=0,\"n/a\",OFFSET(ExistingTx!$DM$5,MATCH($A7,ExistingTx!$C$6:$C$3005,0),0))","v":{"$error":"#DIV/0!"}},{"$f":"IF($L7=0,\"n/a\",OFFSET(ExistingTx!$DP$5,MATCH($A7,ExistingTx!$C$6:$C$3005,0),0))","v":{"$error":"#DIV/0!"}},{"$f":"IF($L7=0,\"n/a\",OFFSET(ExistingTx!$CU$5,MATCH($A7,ExistingTx!$C$6:$C$3005,0),0))","v":{"$error":"#DIV/0!"}},{"$f":"IF(SUM(IF(IF(SupplyCurve!$D$5:$D$3004=\"Incremental Upgrades\",SupplyCurve!$N$5:$N$3004,FALSE)=$C7,SupplyCurve!$X$5:$X$3004,0))>0,SUM(IF($A7=ExistingTx!$C$6:$C$3005,ExistingTx!$CL$6:$CL$3005,0))/$I7,0)","v":0},{"$f":"SUM(IF(IF(SupplyCurve!$D$5:$D$3004=\"Incremental Upgrades\",SupplyCurve!$N$5:$N$3004,FALSE)=$C7,SupplyCurve!$BN$5:$BN$3004/SupplyCurve!$X$5:$X$3004,0))*U7","v":0},{"$f":"IF($U7=0,\"n/a\",OFFSET(ExistingTx!$DG$5,MATCH($A7,ExistingTx!$C$6:$C$3005,0),0)+OFFSET(SupplyCurve!$CC$4,MATCH($C7&\" - Incr.\",SupplyCurve!$G$5:$G$3004,0),0))","v":"n/a"},{"$f":"IF($U7=0,\"n/a\",MAX(MIN((W7-lowCost)*100/(highCost-lowCost),100),0))","v":"n/a"},{"$f":"IF($U7=0,\"n/a\",OFFSET(ExistingTx!$DJ$5,MATCH($A7,ExistingTx!$C$6:$C$3005,0),0))","v":"n/a"},{"$f":"IF($U7=0,\"n/a\",OFFSET(ExistingTx!$DL$5,MATCH($A7,ExistingTx!$C$6:$C$3005,0),0))","v":"n/a"},{"$f":"IF($U7=0,\"n/a\",OFFSET(ExistingTx!$DN$5,MATCH($A7,ExistingTx!$C$6:$C$3005,0),0))","v":"n/a"},{"$f":"IF($U7=0,\"n/a\",OFFSET(SupplyCurve!$CL$4,MATCH($C7&\" - Incr.\",SupplyCurve!$G$5:$G$3004,0),0))","v":"n/a"},{"$f":"IF($U7=0,\"n/a\",OFFSET(ExistingTx!$CV$5,MATCH($A7,ExistingTx!$C$6:$C$3005,0),0))","v":"n/a"},{"$f":"SUM(IF($A7=NewTx!$C$6:$C$3005,NewTx!$BO$6:$BO$3005,0))/$I7","v":{"$error":"#DIV/0!"}},{"$f":"SUM(IF($A7=NewTx!$C$6:$C$3005,NewTx!$BT$6:$BT$3005,0))/$I7","v":{"$error":"#DIV/0!"}},{"$f":"SUM(IF($A7=NewTx!$C$6:$C$3005,NewTx!$BY$6:$BY$3005,0))/$I7","v":{"$error":"#DIV/0!"}},{"$f":"SUM(IF($A7=NewTx!$C$6:$C$3005,NewTx!$CD$6:$CD$3005,0))/$I7","v":{"$error":"#DIV/0!"}},{"$f":"AD7*SUM(IF(IF(IF(SupplyCurve!$D$5:$D$3004=\"New Tx\",SupplyCurve!$E$5:$E$3004,FALSE)=1,SupplyCurve!$N$5:$N$3004,FALSE)=$C7,SupplyCurve!$BN$5:$BN$3004/SupplyCurve!$X$5:$X$3004))+AE7*SUM(IF(IF(IF(SupplyCurve!$D$5:$D$3004=\"New Tx\",SupplyCurve!$E$5:$E$3004,FALSE)=2,SupplyCurve!$N$5:$N$3004,FALSE)=$C7,SupplyCurve!$BN$5:$BN$3004/SupplyCurve!$X$5:$X$3004))+AF7*SUM(IF(IF(IF(SupplyCurve!$D$5:$D$3004=\"New Tx\",SupplyCurve!$E$5:$E$3004,FALSE)=3,SupplyCurve!$N$5:$N$3004,FALSE)=$C7,SupplyCurve!$BN$5:$BN$3004/SupplyCurve!$X$5:$X$3004))+AG7*SUM(IF(IF(IF(SupplyCurve!$D$5:$D$3004=\"New Tx\",SupplyCurve!$E$5:$E$3004,FALSE)=4,SupplyCurve!$N$5:$N$3004,FALSE)=$C7,SupplyCurve!$BN$5:$BN$3004/SupplyCurve!$X$5:$X$3004))","v":{"$error":"#DIV/0!"}},{"$f":"IF(SUM($AD7:$AG7)=0,\"n/a\",OFFSET(NewTx!$CY$5,MATCH($A7,NewTx!$C$6:$C$3004,0),0))","v":{"$error":"#DIV/0!"}},{"$f":"IF(SUM($AD7:$AG7)=0,\"n/a\",OFFSET(NewTx!$DA$5,MATCH($A7,NewTx!$C$6:$C$3004,0),0))","v":{"$error":"#DIV/0!"}},{"$f":"IF(SUM($AD7:$AG7)=0,\"n/a\",OFFSET(NewTx!$DB$5,MATCH($A7,NewTx!$C$6:$C$3004,0),0))","v":{"$error":"#DIV/0!"}},{"$f":"IF(SUM($AD7:$AG7)=0,\"n/a\",OFFSET(NewTx!$DC$5,MATCH($A7,NewTx!$C$6:$C$3004,0),0))","v":{"$error":"#DIV/0!"}},{"$f":"IF(SUM($AD7:$AG7)=0,\"n/a\",OFFSET(NewTx!$DD$5,MATCH($A7,NewTx!$C$6:$C$3004,0),0))","v":{"$error":"#DIV/0!"}},{"$f":"IF(SUM($AD7:$AG7)=0,\"n/a\",OFFSET(NewTx!$DF$5,MATCH($A7,NewTx!$C$6:$C$3004,0),0))","v":{"$error":"#DIV/0!"}},{"$f":"IF(AD7=0,\"n/a\",OFFSET(NewTx!$CK$5,MATCH($A7,NewTx!$C$6:$C$3004,0),0))","v":{"$error":"#DIV/0!"}},{"$f":"IF(AE7=0,\"n/a\",OFFSET(NewTx!$CK$5,MATCH($A7,NewTx!$C$6:$C$3004,0),0))","v":{"$error":"#DIV/0!"}},{"$f":"IF(AF7=0,\"n/a\",OFFSET(NewTx!$CK$5,MATCH($A7,NewTx!$C$6:$C$3004,0),0))","v":{"$error":"#DIV/0!"}},{"$f":"IF(AG7=0,\"n/a\",OFFSET(NewTx!$CK$5,MATCH($A7,NewTx!$C$6:$C$3004,0),0))","v":{"$error":"#DIV/0!"}},{"$f":"SUM(IF(IF(RIGHT(SupplyCurve!$D$5:$D$3004,4)=\"TREC\",SupplyCurve!$G$5:$G$3004,FALSE)=$A7,SupplyCurve!$S$5:$S$3004,0))/$I7","v":{"$error":"#DIV/0!"}},{"$f":"SUM(IF(IF(RIGHT(SupplyCurve!$D$5:$D$3004,4)=\"TREC\",SupplyCurve!$G$5:$G$3004,FALSE)=$A7,SupplyCurve!$BN$5:$BN$3004,0))/$I7","v":{"$error":"#DIV/0!"}},{"$f":"IF($AS7=0,\"n/a\",OFFSET(SupplyCurve!$CE$4,MATCH($A7,SupplyCurve!$G$5:$G$3004,0),0))","v":{"$error":"#DIV/0!"}},{"$f":"IF($AS7=0,\"n/a\",OFFSET(SupplyCurve!CG$4,MATCH($A7,SupplyCurve!$G$5:$G$3004,0),0))","v":{"$error":"#DIV/0!"}},{"$f":"IF($AS7=0,\"n/a\",OFFSET(SupplyCurve!CH$4,MATCH($A7,SupplyCurve!$G$5:$G$3004,0),0))","v":{"$error":"#DIV/0!"}},{"$f":"IF($AS7=0,\"n/a\",OFFSET(SupplyCurve!CI$4,MATCH($A7,SupplyCurve!$G$5:$G$3004,0),0))","v":{"$error":"#DIV/0!"}},{"$f":"IF($AS7=0,\"n/a\",OFFSET(SupplyCurve!CJ$4,MATCH($A7,SupplyCurve!$G$5:$G$3004,0),0))","v":{"$error":"#DIV/0!"}},{"$f":"IF($AS7=0,\"n/a\",OFFSET(SupplyCurve!CL$4,MATCH($A7,SupplyCurve!$G$5:$G$3004,0),0))","v":{"$error":"#DIV/0!"}},{"$f":"IF($AS7=0,\"n/a\",OFFSET(SupplyCurve!BT$4,MATCH($A7,SupplyCurve!$G$5:$G$3004,0),0))","v":{"$error":"#DIV/0!"}}]

{"sheet":"CommercialProjects","index":2,"n_rows":7,"n_cols":53,"rows_kept":7,"cut":false,"hidden":false,"merged":[[3,0,3,1],[3,2,3,3],[4,44,4,52],[4,0,4,10],[4,11,4,19],[4,20,4,28],[4,29,4,43]]}
["Commercial Interest Projects to meet the California RES (from the Energy Division database, IOU small solar program plans, and POU procurement plans)"]
["Projects"]
[]
["Instructions: To determine the capacity (MW) or energy (MWh) a project contributes to the case by type of delivery, multiply the project's capacity or energy (columns H & I) by the project's selected fraction for that delivery method (columns M, V, AH, and AT)",null,null,null," "]
["Project Information",null,null,null,null,null,null,null,null,null,null,"For Delivery over Existing Transmission",null,null,null,null,null,null,null,null,"For Delivery over Minor Upgrades",null,null,null,null,null,null,null,null,"For Delivery over New Transmission",null,null,null,null,null,null,null,null,null,null,null,null,null,null,"For Delivery as Out-of-State REC"]
["ID#","Project ID","Zone","Region","Type","Sub-Type","Location for Resource Type","Capacity (MW)","Energy (GWh)","Discounted Core","Commercial Project","Available","Selected","Net Cost","Cost Score","Environmental Score","Commercial Interest Score","Timing Score","Weighted Score","Year Available","Available","Selected","Net Cost","Cost Score","Environmental Score","Commercial Interest Score","Timing Score","Bundle Score","Year Available","Available - Segment 1","Available - Segment 2","Available - Segment 3","Available - Segment 4","Selected","Net Cost","Cost Score","Environmental Score","Commercial Interest Score","Timing Score (New Transmission)","Weighted Score (New Transmission)","Year Available (Segment 1)","Year Available (Segment 2)","Year Available (Segment 3)","Year Available (Segment 4)","Available","Selected","Net Cost","Cost Score","Environmental Score","Commercial Interest Score","Timing Score","Weighted Score","Year Available"]
[{"$f":"\"CI\"&TEXT(ROW()-ROW($A$6),\"0000\")","v":"CI0001"},{"$f":"OFFSET(CommProjRanks!$B$1,RIGHT($A7,4),0)","v":0},{"$f":"OFFSET(CommProjRanks!$H$1,RIGHT($A7,4),0)","v":0},{"$f":"OFFSET(CommProjRanks!$K$1,RIGHT($A7,4),0)","v":0},{"$f":"OFFSET(CommProjRanks!$D$1,RIGHT($A7,4),0)","v":0},{"$f":"OFFSET(CommProjRanks!$E$1,RIGHT($A7,4),0)","v":0},{"$f":"OFFSET(CommProjRanks!$F$1,RIGHT($A7,4),0)","v":0},{"$f":"OFFSET(CommProjRanks!$P$1,RIGHT($A7,4),0)","v":0},{"$f":"OFFSET(CommProjRanks!$S$1,RIGHT($A7,4),0)","v":0},{"$f":"OFFSET(CommProjRanks!$O$1,RIGHT($A7,4),0)","v":0},1,{"$f":"SUM(IF(IF(SupplyCurve!$D$5:$D$3004=\"Existing Tx\",SupplyCurve!$G$5:$G$3004,FALSE)=$A7,SupplyCurve!$X$5:$X$3004,0))/$I7","v":{"$error":"#DIV/0!"}},{"$f":"SUM(IF(IF(SupplyCurve!$D$5:$D$3004=\"Existing Tx\",SupplyCurve!$G$5:$G$3004,FALSE)=$A7,SupplyCurve!$BN$5:$BN$3004,0))/$I7","v":{"$error":"#DIV/0!"}},{"$f":"IF($L7=0,\"n/a\",OFFSET(ExistingTx!$DG$5,MATCH($A7,ExistingTx!$C$6:$C$3005,0),0))","v":{"$error":"#DIV/0!"}},{"$f":"IF($L7=0,\"n/a\",OFFSET(ExistingTx!$DI$5,MATCH($A7,ExistingTx!$C$6:$C$3005,0),0))","v":{"$error":"#DIV/0!"}},{"$f":"IF($L7=0,\"n/a\",OFFSET(ExistingTx!$DJ$5,MATCH($A7,ExistingTx!$C$6:$C$3005,0),0))","v":{"$error":"#DIV/0!"}},{"$f":"IF($L7=0,\"n/a\",OFFSET(ExistingTx!$DL$5,MATCH($A7,ExistingTx!$C$6:$C$3005,0),0))","v":{"$error":"#DIV/0!"}},{"$f":"IF($L7=0,\"n/a\",OFFSET(ExistingTx!$DM$5,MATCH($A7,ExistingTx!$C$6:$C$3005,0),0))","v":{"$error":"#DIV/0!"}},{"$f":"IF($L7=0,\"n/a\",OFFSET(ExistingTx!$DP$5,MATCH($A7,ExistingTx!$C$6:$C$3005,0),0))","v":{"$error":"#DIV/0!"}},{"$f":"IF($L7=0,\"n/a\",OFFSET(ExistingTx!$CU$5,MATCH($A7,ExistingTx!$C$6:$C$3005,0),0))","v":{"$error":"#DIV/0!"}},{"$f":"IF(SUM(IF(IF(SupplyCurve!$D$5:$D$3004=\"Incremental Upgrades\",SupplyCurve!$N$5:$N$3004,FALSE)=$C7,SupplyCurve!$X$5:$X$3004,0))>0,SUM(IF($A7=ExistingTx!$C$6:$C$3005,ExistingTx!$CL$6:$CL$3005,0))/$I7,0)","v":0},{"$f":"SUM(IF(IF(SupplyCurve!$D$5:$D$3004=\"Incremental Upgrades\",SupplyCurve!$N$5:$N$3004,FALSE)=$C7,SupplyCurve!$BN$5:$BN$3004/SupplyCurve!$X$5:$X$3004,0))*U7","v":0},{"$f":"IF($U7=0,\"n/a\",OFFSET(ExistingTx!$DG$5,MATCH($A7,ExistingTx!$C$6:$C$3005,0),0)+OFFSET(SupplyCurve!$CC$4,MATCH($C7&\" - Incr.\",SupplyCurve!$G$5:$G$3004,0),0))","v":"n/a"},{"$f":"IF($U7=0,\"n/a\",MAX(MIN((W7-lowCost)*100/(highCost-lowCost),100),0))","v":"n/a"},{"$f":"IF($U7=0,\"n/a\",OFFSET(ExistingTx!$DJ$5,MATCH($A7,ExistingTx!$C$6:$C$3005,0),0))","v":"n/a"},{"$f":"IF($U7=0,\"n/a\",OFFSET(ExistingTx!$DL$5,MATCH($A7,ExistingTx!$C$6:$C$3005,0),0))","v":"n/a"},{"$f":"IF($U7=0,\"n/a\",OFFSET(ExistingTx!$DN$5,MATCH($A7,ExistingTx!$C$6:$C$3005,0),0))","v":"n/a"},{"$f":"IF($U7=0,\"n/a\",OFFSET(SupplyCurve!$CL$4,MATCH($C7&\" - Incr.\",SupplyCurve!$G$5:$G$3004,0),0))","v":"n/a"},{"$f":"IF($U7=0,\"n/a\",OFFSET(ExistingTx!$CV$5,MATCH($A7,ExistingTx!$C$6:$C$3005,0),0))","v":"n/a"},{"$f":"SUM(IF($A7=NewTx!$C$6:$C$3005,NewTx!$BO$6:$BO$3005,0))/$I7","v":{"$error":"#DIV/0!"}},{"$f":"SUM(IF($A7=NewTx!$C$6:$C$3005,NewTx!$BT$6:$BT$3005,0))/$I7","v":{"$error":"#DIV/0!"}},{"$f":"SUM(IF($A7=NewTx!$C$6:$C$3005,NewTx!$BY$6:$BY$3005,0))/$I7","v":{"$error":"#DIV/0!"}},{"$f":"SUM(IF($A7=NewTx!$C$6:$C$3005,NewTx!$CD$6:$CD$3005,0))/$I7","v":{"$error":"#DIV/0!"}},{"$f":"AD7*SUM(IF(IF(IF(SupplyCurve!$D$5:$D$3004=\"New Tx\",SupplyCurve!$E$5:$E$3004,FALSE)=1,SupplyCurve!$N$5:$N$3004,FALSE)=$C7,SupplyCurve!$BN$5:$BN$3004/SupplyCurve!$X$5:$X$3004))+AE7*SUM(IF(IF(IF(SupplyCurve!$D$5:$D$3004=\"New Tx\",SupplyCurve!$E$5:$E$3004,FALSE)=2,SupplyCurve!$N$5:$N$3004,FALSE)=$C7,SupplyCurve!$BN$5:$BN$3004/SupplyCurve!$X$5:$X$3004))+AF7*SUM(IF(IF(IF(SupplyCurve!$D$5:$D$3004=\"New Tx\",SupplyCurve!$E$5:$E$3004,FALSE)=3,SupplyCurve!$N$5:$N$3004,FALSE)=$C7,SupplyCurve!$BN$5:$BN$3004/SupplyCurve!$X$5:$X$3004))+AG7*SUM(IF(IF(IF(SupplyCurve!$D$5:$D$3004=\"New Tx\",SupplyCurve!$E$5:$E$3004,FALSE)=4,SupplyCurve!$N$5:$N$3004,FALSE)=$C7,SupplyCurve!$BN$5:$BN$3004/SupplyCurve!$X$5:$X$3004))","v":{"$error":"#DIV/0!"}},{"$f":"IF(SUM($AD7:$AG7)=0,\"n/a\",OFFSET(NewTx!$CY$5,MATCH($A7,NewTx!$C$6:$C$3004,0),0))","v":{"$error":"#DIV/0!"}},{"$f":"IF(SUM($AD7:$AG7)=0,\"n/a\",OFFSET(NewTx!$DA$5,MATCH($A7,NewTx!$C$6:$C$3004,0),0))","v":{"$error":"#DIV/0!"}},{"$f":"IF(SUM($AD7:$AG7)=0,\"n/a\",OFFSET(NewTx!$DB$5,MATCH($A7,NewTx!$C$6:$C$3004,0),0))","v":{"$error":"#DIV/0!"}},{"$f":"IF(SUM($AD7:$AG7)=0,\"n/a\",OFFSET(NewTx!$DC$5,MATCH($A7,NewTx!$C$6:$C$3004,0),0))","v":{"$error":"#DIV/0!"}},{"$f":"IF(SUM($AD7:$AG7)=0,\"n/a\",OFFSET(NewTx!$DD$5,MATCH($A7,NewTx!$C$6:$C$3004,0),0))","v":{"$error":"#DIV/0!"}},{"$f":"IF(SUM($AD7:$AG7)=0,\"n/a\",OFFSET(NewTx!$DF$5,MATCH($A7,NewTx!$C$6:$C$3004,0),0))","v":{"$error":"#DIV/0!"}},{"$f":"IF(AD7=0,\"n/a\",OFFSET(NewTx!$CK$5,MATCH($A7,NewTx!$C$6:$C$3004,0),0))","v":{"$error":"#DIV/0!"}},{"$f":"IF(AE7=0,\"n/a\",OFFSET(NewTx!$CK$5,MATCH($A7,NewTx!$C$6:$C$3004,0),0))","v":{"$error":"#DIV/0!"}},{"$f":"IF(AF7=0,\"n/a\",OFFSET(NewTx!$CK$5,MATCH($A7,NewTx!$C$6:$C$3004,0),0))","v":{"$error":"#DIV/0!"}},{"$f":"IF(AG7=0,\"n/a\",OFFSET(NewTx!$CK$5,MATCH($A7,NewTx!$C$6:$C$3004,0),0))","v":{"$error":"#DIV/0!"}},{"$f":"SUM(IF(IF(RIGHT(SupplyCurve!$D$5:$D$3004,4)=\"TREC\",SupplyCurve!$G$5:$G$3004,FALSE)=$A7,SupplyCurve!$S$5:$S$3004,0))/$I7","v":{"$error":"#DIV/0!"}},{"$f":"SUM(IF(IF(RIGHT(SupplyCurve!$D$5:$D$3004,4)=\"TREC\",SupplyCurve!$G$5:$G$3004,FALSE)=$A7,SupplyCurve!$BN$5:$BN$3004,0))/$I7","v":{"$error":"#DIV/0!"}},{"$f":"IF($AS7=0,\"n/a\",OFFSET(SupplyCurve!$CE$4,MATCH($A7,SupplyCurve!$G$5:$G$3004,0),0))","v":{"$error":"#DIV/0!"}},{"$f":"IF($AS7=0,\"n/a\",OFFSET(SupplyCurve!CG$4,MATCH($A7,SupplyCurve!$G$5:$G$3004,0),0))","v":{"$error":"#DIV/0!"}},{"$f":"IF($AS7=0,\"n/a\",OFFSET(SupplyCurve!CH$4,MATCH($A7,SupplyCurve!$G$5:$G$3004,0),0))","v":{"$error":"#DIV/0!"}},{"$f":"IF($AS7=0,\"n/a\",OFFSET(SupplyCurve!CI$4,MATCH($A7,SupplyCurve!$G$5:$G$3004,0),0))","v":{"$error":"#DIV/0!"}},{"$f":"IF($AS7=0,\"n/a\",OFFSET(SupplyCurve!CJ$4,MATCH($A7,SupplyCurve!$G$5:$G$3004,0),0))","v":{"$error":"#DIV/0!"}},{"$f":"IF($AS7=0,\"n/a\",OFFSET(SupplyCurve!CL$4,MATCH($A7,SupplyCurve!$G$5:$G$3004,0),0))","v":{"$error":"#DIV/0!"}},{"$f":"IF($AS7=0,\"n/a\",OFFSET(SupplyCurve!BT$4,MATCH($A7,SupplyCurve!$G$5:$G$3004,0),0))","v":{"$error":"#DIV/0!"}}]

{"sheet":"Control Panel","index":3,"n_rows":50,"n_cols":27,"rows_kept":50,"cut":false,"hidden":false,"merged":[[2,2,2,4]]}
[]
[]
[null,null,"Model Parameter Specification",null,null,null,null," "]
[null,null,"Ranking Score Weighting"]
[null,null,"REC Eligibility"]
[null,null,"RPS Scenario"]
[null,null,"Existing Transmission Build"]
[null,null,"Active Discounted Core"]
[null,null,"Large Scale Solar PV Resource"]
[null,null,"Price Cap on RECs"]
[null,null,"Gas Price Scenario"]
[null,null,"CO2 Price Scenario"]
[null,null,"RETI Solar Resources"]
[null,null,"Configuration for lines from WY, MT"]
[]
[null,null,"Threshold for Classification as Discounted Core Line",null,"of GWh from DC Projects"]
[]
[null,null,"Price Cap for REC Resources, if Active",null,"per REC"]
[]
[]
[]
[null,null,null,"Active Case"]
[null,null,"Weight on Cost Score"]
[null,null,"Weight on Environmental Score"]
[null,null,"Weight on Commercial Interest Score"]
[null,null,"Weight on Timing Score"]
[]
[null,null,"Lower Bound for Ranking Cost"]
[null,null,"Upper Bound for Ranking Cost"]
[]
[]
[]
[]
[]
[]
[]
[]
[]
[]
[]
[]
[]
[]
[]
[]
[]
[]
[]
[null,null,null,null,null,null,null,null,null,null,null,null,null,null,null,null,null,null,null,null,null,null,null,null,null,"Total"]
[null,null,null,null,null,null,null,null,null,null,null,null,null,null,null,null,null,null,null,null,null,null,null,null,"MW","GWh","MW"]

{"sheet":"Results","index":4,"n_rows":104,"n_cols":41,"rows_kept":104,"cut":false,"hidden":false,"merged":[[1,10,1,12],[1,15,1,17],[7,1,7,2],[8,1,8,2],[32,3,32,8],[32,9,32,14],[32,15,32,20],[19,3,19,4],[19,5,19,6],[19,7,19,8],[18,3,18,8],[18,9,18,14],[18,15,18,20],[3,1,3,2],[5,1,5,2],[6,1,6,2],[19,9,19,10],[19,11,19,12],[33,25,33,26],[19,13,19,14],[19,15,19,16],[19,17,19,18],[19,19,19,20],[32,21,32,26],[33,19,33,20],[33,21,33,22],[33,23,33,24],[33,3,33,4],[33,5,33,6],[33,7,33,8],[33,15,33,16],[33,17,33,18],[47,4,48,4],[47,5,48,5],[47,6,48,6],[47,7,48,7],[47,20,48,20],[47,9,48,9],[47,10,48,10],[47,11,48,11],[47,12,48,12],[47,13,48,13],[47,8,48,8],[47,22,48,22],[47,23,48,23],[47,24,48,24],[47,28,48,28],[47,25,48,25],[47,40,48,40],[101,13,101,21],[47,34,48,34],[47,36,48,36],[47,37,48,37],[47,38,48,38],[47,39,48,39],[47,26,48,26],[47,27,48,27],[47,14,48,14],[47,15,48,15],[47,18,48,18],[47,19,48,19],[47,29,48,29],[47,30,47,32],[47,21,48,21]]}
[]
[null,null,null,null,null,null,null,null,null,null,"All Resources (GWh)",null,null,null,null,"All Resources (MW)"]
[null,null,null,null,null,null,null,null,null,null,"In-State","Out-of-State","Total",null,null,"In-State","Out-of-State","Total"]
[null,"Total Cost (Millions)",null,null,null,"Project Status","GWh","MW",null,"Biogas",null,null,null,null,"Biogas"]
[null,null,null,null,null,"Discounted Core",null,null,null,"Biomass",null,null,null,null,"Biomass"]
[null,"Cost Score",null,null,null,"Commercial Non-Core",null,null,null,"Geothermal",null,null,null,null,"Geothermal"]
[null,"Environmental Score",null,null,null,"Generic",null,null,null,"Hydro ",null,null,null,null,"Hydro "]
[null,"Commercial Interest Score",null,null,null,"Total",null,null,null,"Large Scale Solar PV",null,null,null,null,"Large Scale Solar PV"]
[null,"Timing Score",null,null,null,null,null,null,null,"Small Solar PV",null,null,null,null,"Small Solar PV"]
[null,null,null,null,null,null,null,null,null,"Solar Thermal",null,null,null,null,"Solar Thermal"]
[null,null,null,null,null,null,null,null,null,"Wind",null,null,null,null,"Wind"]
[null,null,null,null,null,null,null,null,null,"Total",null,null,null,null,"Total"]
[]
[]
[]
[]
[null,null,"Results Summary"]
[]
[null,null,null,"All Resources",null,null,null,null,null,"Discounted Core",null,null,null,null,null,"Commercial Interest"]
[null,null,null,"In-State",null,"Out-of-State",null,"Total",null,"In-State",null,"Out-of-State",null,"Total",null,"In-State",null,"Out-of-State",null,"Total"]
[null,null,null,"GWh","MW","GWh","MW","GWh","MW","GWh","MW","GWh","MW","GWh","MW","GWh","MW","GWh","MW","GWh","MW"]
[null,null,"Biogas"]
[null,null,"Biomass"]
[null,null,"Geothermal"]
[null,null,"Hydro "]
[null,null,"Large Scale Solar PV"]
[null,null,"Small Solar PV"]
[null,null,"Solar Thermal"]
[null,null,"Wind"]
[null,null,"Total"]
[]
[]
[null,null,null,"Delivered over Existing Transmission",null,null,null,null,null,"Delivered over Minor Upgrades",null,null,null,null,null,"Delivered over New Transmission",null,null,null,null,null,"Out-of-State RECs"]
[null,null,null,"In-State",null,"Out-of-State",null,"Total",null,"In-State",null,"Out-of-State",null,"Total",null,"In-State",null,"Out-of-State",null,"Total",null,"In-State",null,"Out-of-State",null,"Total"]
[null,null,null,"GWh","MW","GWh","MW","GWh","MW","GWh","MW","GWh","MW","GWh","MW","GWh","MW","GWh","MW","GWh","MW","GWh","MW","GWh","MW","GWh","MW"]
[null,null,"Biogas"]
[null,null,"Biomass"]
[null,null,"Geothermal"]
[null,null,"Hydro "]
[null,null,"Large Scale Solar PV"]
[null,null,"Small Solar PV"]
[null,null,"Solar Thermal"]
[null,null,"Wind"]
[null,null,"Total"]
[]
[]
[]
[null,null,null,"Total RECs","Biogas","Biomass","Geothermal","Hydro ","Large Scale Solar PV","Small Solar PV","Solar Thermal","Wind","Existing Tx","Minor Upgrades","New Tx","Out-of-State REC",null,"Total MWs (Selected)","Biogas","Biomass","Geothermal","Hydro ","Large Scale Solar PV","Small Solar PV","Solar Thermal","Wind","Existing Tx","Minor Upgrades","New Tx","Out-of-State REC","Dependable MW by RA Zone",null,null,null,"Cost of RECs ($/MWh)",null,"Cost Score","Environmental Score","Commercial Interest Score","Timing Score","Weighted Score"]
[null,null,null,99999999,null,null,null,null,null,null,null,null,null,null,null,null,null,99999999,null,null,null,null,null,null,null,null,null,null,null,null,"PG&E","SCE","SDG&E",null,"Cost of RECs",null,"Cost of RECs","Cost of RECs","Cost of RECs","Cost of RECs","Cost of RECs"]
[null,null,"Total"]
[]
[]
[]
[]
[]
[]
[]
[]
[]
[]
[]
[]
[]
[]
[]
[]
[]
[]
[]
[]
[]
[]
[]
[]
[]
[]
[]
[]
[]
[]
[]
[]
[]
[]
[]
[]
[]
[]
[]
[]
[]
[]
[]
[]
[]
[]
[]
[]
[]
[]
[]
[null,null,null,null,"RECs (GWh)",null,null,null,null,null,null,null,null,"MW Selected"]
["New Tx Line Rank","Delivered Resource Rank","Tx Segment Name","Selected?","Biogas","Biomass","Geothermal","Hydro ","Large Scale Solar PV","Small Solar PV","Solar Thermal","Wind","Total","Biogas","Biomass","Geothermal","Hydro ","Large Scale Solar PV","Small Solar PV","Solar Thermal","Wind","Total"]
[1]

{"sheet":"SupplyCurve","index":5,"n_rows":3004,"n_cols":90,"rows_kept":3004,"cut":false,"hidden":false,"merged":[[1,44,2,44],[0,0,2,0],[0,39,2,39],[0,40,2,40],[0,41,2,41],[0,42,2,42],[1,43,2,43]]}
[null,null,null,null,null,null,"Projects Ranked for Delivery",null,null,null,null,null,null,null,null,null,null,null,null,null,null,null,null,null,null,null,"AB","AZ","BC","CFE","CO","MT","NM","NV","NW","UT","WY",null,null,"RECs from Bundled Transmission","RECs from Existing Transmission","RECs from Minor Upgrades","RECs from Distributed Resources",{"$f":"MAX(AR5:AR3004)","v":0},{"$f":"MAX(AS5:AS3004)","v":0},null,"Resources Delivered over Existing Transmission",null,null,null,null,"Resources Delivered over Minor Upgrades",null,null,null,null,"Resources Delivered over New Transmission",null,null,null,null,"REC Resources",null,"Total Selected",null,null,null,"Total Delivered"]
[null,null,null,null,null,null," ",null,null,null,null,null,null,null,null,null,null,null,null,null,null,null,null,null,null,null,null,null,null,null,null,null,null,null,null,null,null,null,null,null,null,null,null,"Unbundled RECs","Total CA REC Buildup"]
[null,null,null,null,null,null,null,null,null,null,null,null,null,null,null,null,null,"In Origin Zone",null,null,"Delivered"]
["Rank",null,"Delivery Type ID","Resource Type","TX Segment","Position","ID#","Resource ID","Type","Resource ID#","Discounted Core?",null,"State","Resource Zone","Resource Adequacy Zone","Losses to Delivery Zone",null,"MW","GWh",null,"Nameplate MW","Dependable MW","GWh","REC",null,"Subject to REC Limit?",null,null,null,null,null,null,null,null,null,null,null,null,null,null,null,null,null,null,null,null,"Nameplate MW","Dependable MW","GWh","RECs",null,"Nameplate MW","Dependable MW","GWh","RECs",null,"Nameplate MW","Dependable MW","GWh","RECs",null,"RECs",null,"MW","GWh","RECs Selected",null,"MW","Dependable MW","GWh","RECs Selected","In-Service Date",null,"Busbar Cost (LCOE, $/MWh)","Integration Costs ($/MWh)","Distribution System Benefits ($/MWh)",null,"Capacity Value ($/MWh)","Energy Value ($/MWh)",null,"Transmission Cost ($/MWh)",null,"Total Net Cost ($/MWh)",null,"Cost Score","Environmental Score","Commercial Interest Score","Timing Score",null,"Weighted Score"]
[1]
[2]
[3]
[4]
[5]
[6]
[7]
[8]
[9]
[10]
[11]
[12]
[13]
[14]
[15]
[16]
[17]
[18]
[19]
[20]
[21]
[22]
[23]
[24]
[25]
[26]
[27]
[28]
[29]
[30]
[31]
[32]
[33]
[34]
[35]
[36]
[37]
[38]
[39]
[40]
[41]
[42]
[43]
[44]
[45]
[46]
[47]
[48]
[49]
[50]
[51]
[52]
[53]
[54]
[55]
[56]
[57]
[58]
[59]
[60]
[61]
[62]
[63]
[64]
[65]
[66]
[67]
[68]
[69]
[70]
[71]
[72]
[73]
[74]
[75]
[76]
[77]
[78]
[79]
[80]
[81]
[82]
[83]
[84]
[85]
[86]
[87]
[88]
[89]
[90]
[91]
[92]
[93]
[94]
[95]
[96]
[97]
[98]
[99]
[100]
[101]
[102]
[103]
[104]
[105]
[106]
[107]
[108]
[109]
[110]
[111]
[112]
[113]
[114]
[115]
[116]
[117]
[118]
[119]
[120]
[121]
[122]
[123]
[124]
[125]
[126]
[127]
[128]
[129]
[130]
[131]
[132]
[133]
[134]
[135]
[136]
[137]
[138]
[139]
[140]
[141]
[142]
[143]
[144]
[145]
[146]
[147]
[148]
[149]
[150]
[151]
[152]
[153]
[154]
[155]
[156]
[157]
[158]
[159]
[160]
[161]
[162]
[163]
[164]
[165]
[166]
[167]
[168]
[169]
[170]
[171]
[172]
[173]
[174]
[175]
[176]
[177]
[178]
[179]
[180]
[181]
[182]
[183]
[184]
[185]
[186]
[187]
[188]
[189]
[190]
[191]
[192]
[193]
[194]
[195]
[196]
[197]
[198]
[199]
[200]
[201]
[202]
[203]
[204]
[205]
[206]
[207]
[208]
[209]
[210]
[211]
[212]
[213]
[214]
[215]
[216]
[217]
[218]
[219]
[220]
[221]
[222]
[223]
[224]
[225]
[226]
[227]
[228]
[229]
[230]
[231]
[232]
[233]
[234]
[235]
[236]
[237]
[238]
[239]
[240]
[241]
[242]
[243]
[244]
[245]
[246]
[247]
[248]
[249]
[250]
[251]
[252]
[253]
[254]
[255]
[256]
[257]
[258]
[259]
[260]
[261]
[262]
[263]
[264]
[265]
[266]
[267]
[268]
[269]
[270]
[271]
[272]
[273]
[274]
[275]
[276]
[277]
[278]
[279]
[280]
[281]
[282]
[283]
[284]
[285]
[286]
[287]
[288]
[289]
[290]
[291]
[292]
[293]
[294]
[295]
[296]
[297]
[298]
[299]
[300]
[301]
[302]
[303]
[304]
[305]
[306]
[307]
[308]
[309]
[310]
[311]
[312]
[313]
[314]
[315]
[316]
[317]
[318]
[319]
[320]
[321]
[322]
[323]
[324]
[325]
[326]
[327]
[328]
[329]
[330]
[331]
[332]
[333]
[334]
[335]
[336]
[337]
[338]
[339]
[340]
[341]
[342]
[343]
[344]
[345]
[346]
[347]
[348]
[349]
[350]
[351]
[352]
[353]
[354]
[355]
[356]
[357]
[358]
[359]
[360]
[361]
[362]
[363]
[364]
[365]
[366]
[367]
[368]
[369]
[370]
[371]
[372]
[373]
[374]
[375]
[376]
[377]
[378]
[379]
[380]
[381]
[382]
[383]
[384]
[385]
[386]
[387]
[388]
[389]
[390]
[391]
[392]
[393]
[394]
[395]
[396]
[397]
[398]
[399]
[400]
[401]
[402]
[403]
[404]
[405]
[406]
[407]
[408]
[409]
[410]
[411]
[412]
[413]
[414]
[415]
[416]
[417]
[418]
[419]
[420]
[421]
[422]
[423]
[424]
[425]
[426]
[427]
[428]
[429]
[430]
[431]
[432]
[433]
[434]
[435]
[436]
[437]
[438]
[439]
[440]
[441]
[442]
[443]
[444]
[445]
[446]
[447]
[448]
[449]
[450]
[451]
[452]
[453]
[454]
[455]
[456]
[457]
[458]
[459]
[460]
[461]
[462]
[463]
[464]
[465]
[466]
[467]
[468]
[469]
[470]
[471]
[472]
[473]
[474]
[475]
[476]
[477]
[478]
[479]
[480]
[481]
[482]
[483]
[484]
[485]
[486]
[487]
[488]
[489]
[490]
[491]
[492]
[493]
[494]
[495]
[496]
[497]
[498]
[499]
[500]
[501]
[502]
[503]
[504]
[505]
[506]
[507]
[508]
[509]
[510]
[511]
[512]
[513]
[514]
[515]
[516]
[517]
[518]
[519]
[520]
[521]
[522]
[523]
[524]
[525]
[526]
[527]
[528]
[529]
[530]
[531]
[532]
[533]
[534]
[535]
[536]
[537]
[538]
[539]
[540]
[541]
[542]
[543]
[544]
[545]
[546]
[547]
[548]
[549]
[550]
[551]
[552]
[553]
[554]
[555]
[556]
[557]
[558]
[559]
[560]
[561]
[562]
[563]
[564]
[565]
[566]
[567]
[568]
[569]
[570]
[571]
[572]
[573]
[574]
[575]
[576]
[577]
[578]
[579]
[580]
[581]
[582]
[583]
[584]
[585]
[586]
[587]
[588]
[589]
[590]
[591]
[592]
[593]
[594]
[595]
[596]
[597]
[598]
[599]
[600]
[601]
[602]
[603]
[604]
[605]
[606]
[607]
[608]
[609]
[610]
[611]
[612]
[613]
[614]
[615]
[616]
[617]
[618]
[619]
[620]
[621]
[622]
[623]
[624]
[625]
[626]
[627]
[628]
[629]
[630]
[631]
[632]
[633]
[634]
[635]
[636]
[637]
[638]
[639]
[640]
[641]
[642]
[643]
[644]
[645]
[646]
[647]
[648]
[649]
[650]
[651]
[652]
[653]
[654]
[655]
[656]
[657]
[658]
[659]
[660]
[661]
[662]
[663]
[664]
[665]
[666]
[667]
[668]
[669]
[670]
[671]
[672]
[673]
[674]
[675]
[676]
[677]
[678]
[679]
[680]
[681]
[682]
[683]
[684]
[685]
[686]
[687]
[688]
[689]
[690]
[691]
[692]
[693]
[694]
[695]
[696]
[697]
[698]
[699]
[700]
[701]
[702]
[703]
[704]
[705]
[706]
[707]
[708]
[709]
[710]
[711]
[712]
[713]
[714]
[715]
[716]
[717]
[718]
[719]
[720]
[721]
[722]
[723]
[724]
[725]
[726]
[727]
[728]
[729]
[730]
[731]
[732]
[733]
[734]
[735]
[736]
[737]
[738]
[739]
[740]
[741]
[742]
[743]
[744]
[745]
[746]
[747]
[748]
[749]
[750]
[751]
[752]
[753]
[754]
[755]
[756]
[757]
[758]
[759]
[760]
[761]
[762]
[763]
[764]
[765]
[766]
[767]
[768]
[769]
[770]
[771]
[772]
[773]
[774]
[775]
[776]
[777]
[778]
[779]
[780]
[781]
[782]
[783]
[784]
[785]
[786]
[787]
[788]
[789]
[790]
[791]
[792]
[793]
[794]
[795]
[796]
[797]
[798]
[799]
[800]
[801]
[802]
[803]
[804]
[805]
[806]
[807]
[808]
[809]
[810]
[811]
[812]
[813]
[814]
[815]
[816]
[817]
[818]
[819]
[820]
[821]
[822]
[823]
[824]
[825]
[826]
[827]
[828]
[829]
[830]
[831]
[832]
[833]
[834]
[835]
[836]
[837]
[838]
[839]
[840]
[841]
[842]
[843]
[844]
[845]
[846]
[847]
[848]
[849]
[850]
[851]
[852]
[853]
[854]
[855]
[856]
[857]
[858]
[859]
[860]
[861]
[862]
[863]
[864]
[865]
[866]
[867]
[868]
[869]
[870]
[871]
[872]
[873]
[874]
[875]
[876]
[877]
[878]
[879]
[880]
[881]
[882]
[883]
[884]
[885]
[886]
[887]
[888]
[889]
[890]
[891]
[892]
[893]
[894]
[895]
[896]
[897]
[898]
[899]
[900]
[901]
[902]
[903]
[904]
[905]
[906]
[907]
[908]
[909]
[910]
[911]
[912]
[913]
[914]
[915]
[916]
[917]
[918]
[919]
[920]
[921]
[922]
[923]
[924]
[925]
[926]
[927]
[928]
[929]
[930]
[931]
[932]
[933]
[934]
[935]
[936]
[937]
[938]
[939]
[940]
[941]
[942]
[943]
[944]
[945]
[946]
[947]
[948]
[949]
[950]
[951]
[952]
[953]
[954]
[955]
[956]
[957]
[958]
[959]
[960]
[961]
[962]
[963]
[964]
[965]
[966]
[967]
[968]
[969]
[970]
[971]
[972]
[973]
[974]
[975]
[976]
[977]
[978]
[979]
[980]
[981]
[982]
[983]
[984]
[985]
[986]
[987]
[988]
[989]
[990]
[991]
[992]
[993]
[994]
[995]
[996]
[997]
[998]
[999]
[1000]
[1001]
[1002]
[1003]
[1004]
[1005]
[1006]
[1007]
[1008]
[1009]
[1010]
[1011]
[1012]
[1013]
[1014]
[1015]
[1016]
[1017]
[1018]
[1019]
[1020]
[1021]
[1022]
[1023]
[1024]
[1025]
[1026]
[1027]
[1028]
[1029]
[1030]
[1031]
[1032]
[1033]
[1034]
[1035]
[1036]
[1037]
[1038]
[1039]
[1040]
[1041]
[1042]
[1043]
[1044]
[1045]
[1046]
[1047]
[1048]
[1049]
[1050]
[1051]
[1052]
[1053]
[1054]
[1055]
[1056]
[1057]
[1058]
[1059]
[1060]
[1061]
[1062]
[1063]
[1064]
[1065]
[1066]
[1067]
[1068]
[1069]
[1070]
[1071]
[1072]
[1073]
[1074]
[1075]
[1076]
[1077]
[1078]
[1079]
[1080]
[1081]
[1082]
[1083]
[1084]
[1085]
[1086]
[1087]
[1088]
[1089]
[1090]
[1091]
[1092]
[1093]
[1094]
[1095]
[1096]
[1097]
[1098]
[1099]
[1100]
[1101]
[1102]
[1103]
[1104]
[1105]
[1106]
[1107]
[1108]
[1109]
[1110]
[1111]
[1112]
[1113]
[1114]
[1115]
[1116]
[1117]
[1118]
[1119]
[1120]
[1121]
[1122]
[1123]
[1124]
[1125]
[1126]
[1127]
[1128]
[1129]
[1130]
[1131]
[1132]
[1133]
[1134]
[1135]
[1136]
[1137]
[1138]
[1139]
[1140]
[1141]
[1142]
[1143]
[1144]
[1145]
[1146]
[1147]
[1148]
[1149]
[1150]
[1151]
[1152]
[1153]
[1154]
[1155]
[1156]
[1157]
[1158]
[1159]
[1160]
[1161]
[1162]
[1163]
[1164]
[1165]
[1166]
[1167]
[1168]
[1169]
[1170]
[1171]
[1172]
[1173]
[1174]
[1175]
[1176]
[1177]
[1178]
[1179]
[1180]
[1181]
[1182]
[1183]
[1184]
[1185]
[1186]
[1187]
[1188]
[1189]
[1190]
[1191]
[1192]
[1193]
[1194]
[1195]
[1196]
[1197]
[1198]
[1199]
[1200]
[1201]
[1202]
[1203]
[1204]
[1205]
[1206]
[1207]
[1208]
[1209]
[1210]
[1211]
[1212]
[1213]
[1214]
[1215]
[1216]
[1217]
[1218]
[1219]
[1220]
[1221]
[1222]
[1223]
[1224]
[1225]
[1226]
[1227]
[1228]
[1229]
[1230]
[1231]
[1232]
[1233]
[1234]
[1235]
[1236]
[1237]
[1238]
[1239]
[1240]
[1241]
[1242]
[1243]
[1244]
[1245]
[1246]
[1247]
[1248]
[1249]
[1250]
[1251]
[1252]
[1253]
[1254]
[1255]
[1256]
[1257]
[1258]
[1259]
[1260]
[1261]
[1262]
[1263]
[1264]
[1265]
[1266]
[1267]
[1268]
[1269]
[1270]
[1271]
[1272]
[1273]
[1274]
[1275]
[1276]
[1277]
[1278]
[1279]
[1280]
[1281]
[1282]
[1283]
[1284]
[1285]
[1286]
[1287]
[1288]
[1289]
[1290]
[1291]
[1292]
[1293]
[1294]
[1295]
[1296]
[1297]
[1298]
[1299]
[1300]
[1301]
[1302]
[1303]
[1304]
[1305]
[1306]
[1307]
[1308]
[1309]
[1310]
[1311]
[1312]
[1313]
[1314]
[1315]
[1316]
[1317]
[1318]
[1319]
[1320]
[1321]
[1322]
[1323]
[1324]
[1325]
[1326]
[1327]
[1328]
[1329]
[1330]
[1331]
[1332]
[1333]
[1334]
[1335]
[1336]
[1337]
[1338]
[1339]
[1340]
[1341]
[1342]
[1343]
[1344]
[1345]
[1346]
[1347]
[1348]
[1349]
[1350]
[1351]
[1352]
[1353]
[1354]
[1355]
[1356]
[1357]
[1358]
[1359]
[1360]
[1361]
[1362]
[1363]
[1364]
[1365]
[1366]
[1367]
[1368]
[1369]
[1370]
[1371]
[1372]
[1373]
[1374]
[1375]
[1376]
[1377]
[1378]
[1379]
[1380]
[1381]
[1382]
[1383]
[1384]
[1385]
[1386]
[1387]
[1388]
[1389]
[1390]
[1391]
[1392]
[1393]
[1394]
[1395]
[1396]
[1397]
[1398]
[1399]
[1400]
[1401]
[1402]
[1403]
[1404]
[1405]
[1406]
[1407]
[1408]
[1409]
[1410]
[1411]
[1412]
[1413]
[1414]
[1415]
[1416]
[1417]
[1418]
[1419]
[1420]
[1421]
[1422]
[1423]
[1424]
[1425]
[1426]
[1427]
[1428]
[1429]
[1430]
[1431]
[1432]
[1433]
[1434]
[1435]
[1436]
[1437]
[1438]
[1439]
[1440]
[1441]
[1442]
[1443]
[1444]
[1445]
[1446]
[1447]
[1448]
[1449]
[1450]
[1451]
[1452]
[1453]
[1454]
[1455]
[1456]
[1457]
[1458]
[1459]
[1460]
[1461]
[1462]
[1463]
[1464]
[1465]
[1466]
[1467]
[1468]
[1469]
[1470]
[1471]
[1472]
[1473]
[1474]
[1475]
[1476]
[1477]
[1478]
[1479]
[1480]
[1481]
[1482]
[1483]
[1484]
[1485]
[1486]
[1487]
[1488]
[1489]
[1490]
[1491]
[1492]
[1493]
[1494]
[1495]
[1496]
[1497]
[1498]
[1499]
[1500]
[1501]
[1502]
[1503]
[1504]
[1505]
[1506]
[1507]
[1508]
[1509]
[1510]
[1511]
[1512]
[1513]
[1514]
[1515]
[1516]
[1517]
[1518]
[1519]
[1520]
[1521]
[1522]
[1523]
[1524]
[1525]
[1526]
[1527]
[1528]
[1529]
[1530]
[1531]
[1532]
[1533]
[1534]
[1535]
[1536]
[1537]
[1538]
[1539]
[1540]
[1541]
[1542]
[1543]
[1544]
[1545]
[1546]
[1547]
[1548]
[1549]
[1550]
[1551]
[1552]
[1553]
[1554]
[1555]
[1556]
[1557]
[1558]
[1559]
[1560]
[1561]
[1562]
[1563]
[1564]
[1565]
[1566]
[1567]
[1568]
[1569]
[1570]
[1571]
[1572]
[1573]
[1574]
[1575]
[1576]
[1577]
[1578]
[1579]
[1580]
[1581]
[1582]
[1583]
[1584]
[1585]
[1586]
[1587]
[1588]
[1589]
[1590]
[1591]
[1592]
[1593]
[1594]
[1595]
[1596]
[1597]
[1598]
[1599]
[1600]
[1601]
[1602]
[1603]
[1604]
[1605]
[1606]
[1607]
[1608]
[1609]
[1610]
[1611]
[1612]
[1613]
[1614]
[1615]
[1616]
[1617]
[1618]
[1619]
[1620]
[1621]
[1622]
[1623]
[1624]
[1625]
[1626]
[1627]
[1628]
[1629]
[1630]
[1631]
[1632]
[1633]
[1634]
[1635]
[1636]
[1637]
[1638]
[1639]
[1640]
[1641]
[1642]
[1643]
[1644]
[1645]
[1646]
[1647]
[1648]
[1649]
[1650]
[1651]
[1652]
[1653]
[1654]
[1655]
[1656]
[1657]
[1658]
[1659]
[1660]
[1661]
[1662]
[1663]
[1664]
[1665]
[1666]
[1667]
[1668]
[1669]
[1670]
[1671]
[1672]
[1673]
[1674]
[1675]
[1676]
[1677]
[1678]
[1679]
[1680]
[1681]
[1682]
[1683]
[1684]
[1685]
[1686]
[1687]
[1688]
[1689]
[1690]
[1691]
[1692]
[1693]
[1694]
[1695]
[1696]
[1697]
[1698]
[1699]
[1700]
[1701]
[1702]
[1703]
[1704]
[1705]
[1706]
[1707]
[1708]
[1709]
[1710]
[1711]
[1712]
[1713]
[1714]
[1715]
[1716]
[1717]
[1718]
[1719]
[1720]
[1721]
[1722]
[1723]
[1724]
[1725]
[1726]
[1727]
[1728]
[1729]
[1730]
[1731]
[1732]
[1733]
[1734]
[1735]
[1736]
[1737]
[1738]
[1739]
[1740]
[1741]
[1742]
[1743]
[1744]
[1745]
[1746]
[1747]
[1748]
[1749]
[1750]
[1751]
[1752]
[1753]
[1754]
[1755]
[1756]
[1757]
[1758]
[1759]
[1760]
[1761]
[1762]
[1763]
[1764]
[1765]
[1766]
[1767]
[1768]
[1769]
[1770]
[1771]
[1772]
[1773]
[1774]
[1775]
[1776]
[1777]
[1778]
[1779]
[1780]
[1781]
[1782]
[1783]
[1784]
[1785]
[1786]
[1787]
[1788]
[1789]
[1790]
[1791]
[1792]
[1793]
[1794]
[1795]
[1796]
[1797]
[1798]
[1799]
[1800]
[1801]
[1802]
[1803]
[1804]
[1805]
[1806]
[1807]
[1808]
[1809]
[1810]
[1811]
[1812]
[1813]
[1814]
[1815]
[1816]
[1817]
[1818]
[1819]
[1820]
[1821]
[1822]
[1823]
[1824]
[1825]
[1826]
[1827]
[1828]
[1829]
[1830]
[1831]
[1832]
[1833]
[1834]
[1835]
[1836]
[1837]
[1838]
[1839]
[1840]
[1841]
[1842]
[1843]
[1844]
[1845]
[1846]
[1847]
[1848]
[1849]
[1850]
[1851]
[1852]
[1853]
[1854]
[1855]
[1856]
[1857]
[1858]
[1859]
[1860]
[1861]
[1862]
[1863]
[1864]
[1865]
[1866]
[1867]
[1868]
[1869]
[1870]
[1871]
[1872]
[1873]
[1874]
[1875]
[1876]
[1877]
[1878]
[1879]
[1880]
[1881]
[1882]
[1883]
[1884]
[1885]
[1886]
[1887]
[1888]
[1889]
[1890]
[1891]
[1892]
[1893]
[1894]
[1895]
[1896]
[1897]
[1898]
[1899]
[1900]
[1901]
[1902]
[1903]
[1904]
[1905]
[1906]
[1907]
[1908]
[1909]
[1910]
[1911]
[1912]
[1913]
[1914]
[1915]
[1916]
[1917]
[1918]
[1919]
[1920]
[1921]
[1922]
[1923]
[1924]
[1925]
[1926]
[1927]
[1928]
[1929]
[1930]
[1931]
[1932]
[1933]
[1934]
[1935]
[1936]
[1937]
[1938]
[1939]
[1940]
[1941]
[1942]
[1943]
[1944]
[1945]
[1946]
[1947]
[1948]
[1949]
[1950]
[1951]
[1952]
[1953]
[1954]
[1955]
[1956]
[1957]
[1958]
[1959]
[1960]
[1961]
[1962]
[1963]
[1964]
[1965]
[1966]
[1967]
[1968]
[1969]
[1970]
[1971]
[1972]
[1973]
[1974]
[1975]
[1976]
[1977]
[1978]
[1979]
[1980]
[1981]
[1982]
[1983]
[1984]
[1985]
[1986]
[1987]
[1988]
[1989]
[1990]
[1991]
[1992]
[1993]
[1994]
[1995]
[1996]
[1997]
[1998]
[1999]
[2000]
[2001]
[2002]
[2003]
[2004]
[2005]
[2006]
[2007]
[2008]
[2009]
[2010]
[2011]
[2012]
[2013]
[2014]
[2015]
[2016]
[2017]
[2018]
[2019]
[2020]
[2021]
[2022]
[2023]
[2024]
[2025]
[2026]
[2027]
[2028]
[2029]
[2030]
[2031]
[2032]
[2033]
[2034]
[2035]
[2036]
[2037]
[2038]
[2039]
[2040]
[2041]
[2042]
[2043]
[2044]
[2045]
[2046]
[2047]
[2048]
[2049]
[2050]
[2051]
[2052]
[2053]
[2054]
[2055]
[2056]
[2057]
[2058]
[2059]
[2060]
[2061]
[2062]
[2063]
[2064]
[2065]
[2066]
[2067]
[2068]
[2069]
[2070]
[2071]
[2072]
[2073]
[2074]
[2075]
[2076]
[2077]
[2078]
[2079]
[2080]
[2081]
[2082]
[2083]
[2084]
[2085]
[2086]
[2087]
[2088]
[2089]
[2090]
[2091]
[2092]
[2093]
[2094]
[2095]
[2096]
[2097]
[2098]
[2099]
[2100]
[2101]
[2102]
[2103]
[2104]
[2105]
[2106]
[2107]
[2108]
[2109]
[2110]
[2111]
[2112]
[2113]
[2114]
[2115]
[2116]
[2117]
[2118]
[2119]
[2120]
[2121]
[2122]
[2123]
[2124]
[2125]
[2126]
[2127]
[2128]
[2129]
[2130]
[2131]
[2132]
[2133]
[2134]
[2135]
[2136]
[2137]
[2138]
[2139]
[2140]
[2141]
[2142]
[2143]
[2144]
[2145]
[2146]
[2147]
[2148]
[2149]
[2150]
[2151]
[2152]
[2153]
[2154]
[2155]
[2156]
[2157]
[2158]
[2159]
[2160]
[2161]
[2162]
[2163]
[2164]
[2165]
[2166]
[2167]
[2168]
[2169]
[2170]
[2171]
[2172]
[2173]
[2174]
[2175]
[2176]
[2177]
[2178]
[2179]
[2180]
[2181]
[2182]
[2183]
[2184]
[2185]
[2186]
[2187]
[2188]
[2189]
[2190]
[2191]
[2192]
[2193]
[2194]
[2195]
[2196]
[2197]
[2198]
[2199]
[2200]
[2201]
[2202]
[2203]
[2204]
[2205]
[2206]
[2207]
[2208]
[2209]
[2210]
[2211]
[2212]
[2213]
[2214]
[2215]
[2216]
[2217]
[2218]
[2219]
[2220]
[2221]
[2222]
[2223]
[2224]
[2225]
[2226]
[2227]
[2228]
[2229]
[2230]
[2231]
[2232]
[2233]
[2234]
[2235]
[2236]
[2237]
[2238]
[2239]
[2240]
[2241]
[2242]
[2243]
[2244]
[2245]
[2246]
[2247]
[2248]
[2249]
[2250]
[2251]
[2252]
[2253]
[2254]
[2255]
[2256]
[2257]
[2258]
[2259]
[2260]
[2261]
[2262]
[2263]
[2264]
[2265]
[2266]
[2267]
[2268]
[2269]
[2270]
[2271]
[2272]
[2273]
[2274]
[2275]
[2276]
[2277]
[2278]
[2279]
[2280]
[2281]
[2282]
[2283]
[2284]
[2285]
[2286]
[2287]
[2288]
[2289]
[2290]
[2291]
[2292]
[2293]
[2294]
[2295]
[2296]
[2297]
[2298]
[2299]
[2300]
[2301]
[2302]
[2303]
[2304]
[2305]
[2306]
[2307]
[2308]
[2309]
[2310]
[2311]
[2312]
[2313]
[2314]
[2315]
[2316]
[2317]
[2318]
[2319]
[2320]
[2321]
[2322]
[2323]
[2324]
[2325]
[2326]
[2327]
[2328]
[2329]
[2330]
[2331]
[2332]
[2333]
[2334]
[2335]
[2336]
[2337]
[2338]
[2339]
[2340]
[2341]
[2342]
[2343]
[2344]
[2345]
[2346]
[2347]
[2348]
[2349]
[2350]
[2351]
[2352]
[2353]
[2354]
[2355]
[2356]
[2357]
[2358]
[2359]
[2360]
[2361]
[2362]
[2363]
[2364]
[2365]
[2366]
[2367]
[2368]
[2369]
[2370]
[2371]
[2372]
[2373]
[2374]
[2375]
[2376]
[2377]
[2378]
[2379]
[2380]
[2381]
[2382]
[2383]
[2384]
[2385]
[2386]
[2387]
[2388]
[2389]
[2390]
[2391]
[2392]
[2393]
[2394]
[2395]
[2396]
[2397]
[2398]
[2399]
[2400]
[2401]
[2402]
[2403]
[2404]
[2405]
[2406]
[2407]
[2408]
[2409]
[2410]
[2411]
[2412]
[2413]
[2414]
[2415]
[2416]
[2417]
[2418]
[2419]
[2420]
[2421]
[2422]
[2423]
[2424]
[2425]
[2426]
[2427]
[2428]
[2429]
[2430]
[2431]
[2432]
[2433]
[2434]
[2435]
[2436]
[2437]
[2438]
[2439]
[2440]
[2441]
[2442]
[2443]
[2444]
[2445]
[2446]
[2447]
[2448]
[2449]
[2450]
[2451]
[2452]
[2453]
[2454]
[2455]
[2456]
[2457]
[2458]
[2459]
[2460]
[2461]
[2462]
[2463]
[2464]
[2465]
[2466]
[2467]
[2468]
[2469]
[2470]
[2471]
[2472]
[2473]
[2474]
[2475]
[2476]
[2477]
[2478]
[2479]
[2480]
[2481]
[2482]
[2483]
[2484]
[2485]
[2486]
[2487]
[2488]
[2489]
[2490]
[2491]
[2492]
[2493]
[2494]
[2495]
[2496]
[2497]
[2498]
[2499]
[2500]
[2501]
[2502]
[2503]
[2504]
[2505]
[2506]
[2507]
[2508]
[2509]
[2510]
[2511]
[2512]
[2513]
[2514]
[2515]
[2516]
[2517]
[2518]
[2519]
[2520]
[2521]
[2522]
[2523]
[2524]
[2525]
[2526]
[2527]
[2528]
[2529]
[2530]
[2531]
[2532]
[2533]
[2534]
[2535]
[2536]
[2537]
[2538]
[2539]
[2540]
[2541]
[2542]
[2543]
[2544]
[2545]
[2546]
[2547]
[2548]
[2549]
[2550]
[2551]
[2552]
[2553]
[2554]
[2555]
[2556]
[2557]
[2558]
[2559]
[2560]
[2561]
[2562]
[2563]
[2564]
[2565]
[2566]
[2567]
[2568]
[2569]
[2570]
[2571]
[2572]
[2573]
[2574]
[2575]
[2576]
[2577]
[2578]
[2579]
[2580]
[2581]
[2582]
[2583]
[2584]
[2585]
[2586]
[2587]
[2588]
[2589]
[2590]
[2591]
[2592]
[2593]
[2594]
[2595]
[2596]
[2597]
[2598]
[2599]
[2600]
[2601]
[2602]
[2603]
[2604]
[2605]
[2606]
[2607]
[2608]
[2609]
[2610]
[2611]
[2612]
[2613]
[2614]
[2615]
[2616]
[2617]
[2618]
[2619]
[2620]
[2621]
[2622]
[2623]
[2624]
[2625]
[2626]
[2627]
[2628]
[2629]
[2630]
[2631]
[2632]
[2633]
[2634]
[2635]
[2636]
[2637]
[2638]
[2639]
[2640]
[2641]
[2642]
[2643]
[2644]
[2645]
[2646]
[2647]
[2648]
[2649]
[2650]
[2651]
[2652]
[2653]
[2654]
[2655]
[2656]
[2657]
[2658]
[2659]
[2660]
[2661]
[2662]
[2663]
[2664]
[2665]
[2666]
[2667]
[2668]
[2669]
[2670]
[2671]
[2672]
[2673]
[2674]
[2675]
[2676]
[2677]
[2678]
[2679]
[2680]
[2681]
[2682]
[2683]
[2684]
[2685]
[2686]
[2687]
[2688]
[2689]
[2690]
[2691]
[2692]
[2693]
[2694]
[2695]
[2696]
[2697]
[2698]
[2699]
[2700]
[2701]
[2702]
[2703]
[2704]
[2705]
[2706]
[2707]
[2708]
[2709]
[2710]
[2711]
[2712]
[2713]
[2714]
[2715]
[2716]
[2717]
[2718]
[2719]
[2720]
[2721]
[2722]
[2723]
[2724]
[2725]
[2726]
[2727]
[2728]
[2729]
[2730]
[2731]
[2732]
[2733]
[2734]
[2735]
[2736]
[2737]
[2738]
[2739]
[2740]
[2741]
[2742]
[2743]
[2744]
[2745]
[2746]
[2747]
[2748]
[2749]
[2750]
[2751]
[2752]
[2753]
[2754]
[2755]
[2756]
[2757]
[2758]
[2759]
[2760]
[2761]
[2762]
[2763]
[2764]
[2765]
[2766]
[2767]
[2768]
[2769]
[2770]
[2771]
[2772]
[2773]
[2774]
[2775]
[2776]
[2777]
[2778]
[2779]
[2780]
[2781]
[2782]
[2783]
[2784]
[2785]
[2786]
[2787]
[2788]
[2789]
[2790]
[2791]
[2792]
[2793]
[2794]
[2795]
[2796]
[2797]
[2798]
[2799]
[2800]
[2801]
[2802]
[2803]
[2804]
[2805]
[2806]
[2807]
[2808]
[2809]
[2810]
[2811]
[2812]
[2813]
[2814]
[2815]
[2816]
[2817]
[2818]
[2819]
[2820]
[2821]
[2822]
[2823]
[2824]
[2825]
[2826]
[2827]
[2828]
[2829]
[2830]
[2831]
[2832]
[2833]
[2834]
[2835]
[2836]
[2837]
[2838]
[2839]
[2840]
[2841]
[2842]
[2843]
[2844]
[2845]
[2846]
[2847]
[2848]
[2849]
[2850]
[2851]
[2852]
[2853]
[2854]
[2855]
[2856]
[2857]
[2858]
[2859]
[2860]
[2861]
[2862]
[2863]
[2864]
[2865]
[2866]
[2867]
[2868]
[2869]
[2870]
[2871]
[2872]
[2873]
[2874]
[2875]
[2876]
[2877]
[2878]
[2879]
[2880]
[2881]
[2882]
[2883]
[2884]
[2885]
[2886]
[2887]
[2888]
[2889]
[2890]
[2891]
[2892]
[2893]
[2894]
[2895]
[2896]
[2897]
[2898]
[2899]
[2900]
[2901]
[2902]
[2903]
[2904]
[2905]
[2906]
[2907]
[2908]
[2909]
[2910]
[2911]
[2912]
[2913]
[2914]
[2915]
[2916]
[2917]
[2918]
[2919]
[2920]
[2921]
[2922]
[2923]
[2924]
[2925]
[2926]
[2927]
[2928]
[2929]
[2930]
[2931]
[2932]
[2933]
[2934]
[2935]
[2936]
[2937]
[2938]
[2939]
[2940]
[2941]
[2942]
[2943]
[2944]
[2945]
[2946]
[2947]
[2948]
[2949]
[2950]
[2951]
[2952]
[2953]
[2954]
[2955]
[2956]
[2957]
[2958]
[2959]
[2960]
[2961]
[2962]
[2963]
[2964]
[2965]
[2966]
[2967]
[2968]
[2969]
[2970]
[2971]
[2972]
[2973]
[2974]
[2975]
[2976]
[2977]
[2978]
[2979]
[2980]
[2981]
[2982]
[2983]
[2984]
[2985]
[2986]
[2987]
[2988]
[2989]
[2990]
[2991]
[2992]
[2993]
[2994]
[2995]
[2996]
[2997]
[2998]
[2999]
[3000]

{"sheet":"NewTx","index":6,"n_rows":3005,"n_cols":110,"rows_kept":3005,"cut":false,"hidden":false,"merged":[[0,0,3,0]]}
[null,null,null,"Projects Ranked for New Tx",null,null,null,null,null,null,null,null,null,null,null,null,null,null,null,"Alberta","Arizona","Baja","Barstow","British Columbia","Carrizo North","Carrizo South","Colorado","Cuyama","Fairmont","Imperial","Inyokern","Iron Mountain","Kramer","Lassen North","Lassen South","Montana","Mountain Pass","Nevada C","Nevada N","New Mexico","Northwest","Owens Valley","Palm Springs","Pisgah","Riverside East","Round Mountain","San Bernardino - Baker","San Bernardino - Lucerne","San Diego North Central","San Diego South","Santa Barbara","Solano","Tehachapi","Twentynine Palms","Utah-Southern Idaho","Victorville","Westlands","Wyoming","Central Valley North","El Dorado","Merced","Los Banos"]
[null,null,null,null,null,null,null,null,null,null,null,null,null,null,null,null,null,null,"MW per Segment",null,null,null,null,null,null,null,null,null,null,null,null,null,null,null,null,null,null,null,null,null,null,null,null,null,null,null,null,null,null,null,null,null,null,null,null,null,null,null,null,null,null,null,null,"First Line Segment from Zone - Delivered",null,null,null,null,"Second Line Segment from Zone",null,null,null,null,"Third Line Segment from Zone",null,null,null,null,"Fourth Line Segment from Zone",null,null,null,null,"All Segments"]
[null,null,null,null,null,null," ",null,null,null,null,null,null,null,null,null,null,null,"Lines per Zone",null,null,null,null,null,null,null,null,null,null,null,null,null,null,null,null,null,null,null,null,null,null,null,null,null,null,null,null,null,null,null,null,null,null,null,null,null,null,null,null,null,null,null,null,1,null,null,null,null,2,null,null,null,null,3,null,null,null,null,4]
[null,null,null,null,null,null,null,null,null,null,null,null,null,null,null,null,null,null,"Total MW Selected by Zone"]
["Rank",null,"ID#","Resource ID","Type","Resource Locator","Intermediate Zone?","Discounted Core?","MW","Dependable MW","GWh",null,"Region","Resource Zone","RA Zone","Zone Identifier","Losses to Delivery Zone, New Transmission",null,"Cumulative MW Selected by Zone",0,0,0,0,0,0,0,0,0,0,0,0,0,0,0,0,null,0,0,0,0,0,0,0,0,0,0,0,0,0,0,0,0,0,0,0,0,0,0,0,0,0,0,null,"MW","Dependable Capacity (MW)","GWh","RECs",null,"MW","Dependable Capacity (MW)","GWh","RECs",null,"MW","Dependable Capacity (MW)","GWh","RECs",null,"MW","Dependable Capacity (MW)","GWh","RECs",null,"MW","Dependable Capacity (MW)","GWh","RECs",null,"Year Available","Year Available","Year Available","Year Available",null,"Busbar Cost (LCOE, $/MWh)","Integration Costs ($/MWh)","Distribution System Benefits ($/MWh)",null,"Capacity Value - Delivered to CA ($/MWh)","Energy Value - Delivered to CA ($/MWh)",null,"Transmission Cost",null,"REC Cost",null,"Cost Score","Environmental Score","Commercial Interest Score","Timing Score",null,"Weighted Score"]
[1]
[2]
[3]
[4]
[5]
[6]
[7]
[8]
[9]
[10]
[11]
[12]
[13]
[14]
[15]
[16]
[17]
[18]
[19]
[20]
[21]
[22]
[23]
[24]
[25]
[26]
[27]
[28]
[29]
[30]
[31]
[32]
[33]
[34]
[35]
[36]
[37]
[38]
[39]
[40]
[41]
[42]
[43]
[44]
[45]
[46]
[47]
[48]
[49]
[50]
[51]
[52]
[53]
[54]
[55]
[56]
[57]
[58]
[59]
[60]
[61]
[62]
[63]
[64]
[65]
[66]
[67]
[68]
[69]
[70]
[71]
[72]
[73]
[74]
[75]
[76]
[77]
[78]
[79]
[80]
[81]
[82]
[83]
[84]
[85]
[86]
[87]
[88]
[89]
[90]
[91]
[92]
[93]
[94]
[95]
[96]
[97]
[98]
[99]
[100]
[101]
[102]
[103]
[104]
[105]
[106]
[107]
[108]
[109]
[110]
[111]
[112]
[113]
[114]
[115]
[116]
[117]
[118]
[119]
[120]
[121]
[122]
[123]
[124]
[125]
[126]
[127]
[128]
[129]
[130]
[131]
[132]
[133]
[134]
[135]
[136]
[137]
[138]
[139]
[140]
[141]
[142]
[143]
[144]
[145]
[146]
[147]
[148]
[149]
[150]
[151]
[152]
[153]
[154]
[155]
[156]
[157]
[158]
[159]
[160]
[161]
[162]
[163]
[164]
[165]
[166]
[167]
[168]
[169]
[170]
[171]
[172]
[173]
[174]
[175]
[176]
[177]
[178]
[179]
[180]
[181]
[182]
[183]
[184]
[185]
[186]
[187]
[188]
[189]
[190]
[191]
[192]
[193]
[194]
[195]
[196]
[197]
[198]
[199]
[200]
[201]
[202]
[203]
[204]
[205]
[206]
[207]
[208]
[209]
[210]
[211]
[212]
[213]
[214]
[215]
[216]
[217]
[218]
[219]
[220]
[221]
[222]
[223]
[224]
[225]
[226]
[227]
[228]
[229]
[230]
[231]
[232]
[233]
[234]
[235]
[236]
[237]
[238]
[239]
[240]
[241]
[242]
[243]
[244]
[245]
[246]
[247]
[248]
[249]
[250]
[251]
[252]
[253]
[254]
[255]
[256]
[257]
[258]
[259]
[260]
[261]
[262]
[263]
[264]
[265]
[266]
[267]
[268]
[269]
[270]
[271]
[272]
[273]
[274]
[275]
[276]
[277]
[278]
[279]
[280]
[281]
[282]
[283]
[284]
[285]
[286]
[287]
[288]
[289]
[290]
[291]
[292]
[293]
[294]
[295]
[296]
[297]
[298]
[299]
[300]
[301]
[302]
[303]
[304]
[305]
[306]
[307]
[308]
[309]
[310]
[311]
[312]
[313]
[314]
[315]
[316]
[317]
[318]
[319]
[320]
[321]
[322]
[323]
[324]
[325]
[326]
[327]
[328]
[329]
[330]
[331]
[332]
[333]
[334]
[335]
[336]
[337]
[338]
[339]
[340]
[341]
[342]
[343]
[344]
[345]
[346]
[347]
[348]
[349]
[350]
[351]
[352]
[353]
[354]
[355]
[356]
[357]
[358]
[359]
[360]
[361]
[362]
[363]
[364]
[365]
[366]
[367]
[368]
[369]
[370]
[371]
[372]
[373]
[374]
[375]
[376]
[377]
[378]
[379]
[380]
[381]
[382]
[383]
[384]
[385]
[386]
[387]
[388]
[389]
[390]
[391]
[392]
[393]
[394]
[395]
[396]
[397]
[398]
[399]
[400]
[401]
[402]
[403]
[404]
[405]
[406]
[407]
[408]
[409]
[410]
[411]
[412]
[413]
[414]
[415]
[416]
[417]
[418]
[419]
[420]
[421]
[422]
[423]
[424]
[425]
[426]
[427]
[428]
[429]
[430]
[431]
[432]
[433]
[434]
[435]
[436]
[437]
[438]
[439]
[440]
[441]
[442]
[443]
[444]
[445]
[446]
[447]
[448]
[449]
[450]
[451]
[452]
[453]
[454]
[455]
[456]
[457]
[458]
[459]
[460]
[461]
[462]
[463]
[464]
[465]
[466]
[467]
[468]
[469]
[470]
[471]
[472]
[473]
[474]
[475]
[476]
[477]
[478]
[479]
[480]
[481]
[482]
[483]
[484]
[485]
[486]
[487]
[488]
[489]
[490]
[491]
[492]
[493]
[494]
[495]
[496]
[497]
[498]
[499]
[500]
[501]
[502]
[503]
[504]
[505]
[506]
[507]
[508]
[509]
[510]
[511]
[512]
[513]
[514]
[515]
[516]
[517]
[518]
[519]
[520]
[521]
[522]
[523]
[524]
[525]
[526]
[527]
[528]
[529]
[530]
[531]
[532]
[533]
[534]
[535]
[536]
[537]
[538]
[539]
[540]
[541]
[542]
[543]
[544]
[545]
[546]
[547]
[548]
[549]
[550]
[551]
[552]
[553]
[554]
[555]
[556]
[557]
[558]
[559]
[560]
[561]
[562]
[563]
[564]
[565]
[566]
[567]
[568]
[569]
[570]
[571]
[572]
[573]
[574]
[575]
[576]
[577]
[578]
[579]
[580]
[581]
[582]
[583]
[584]
[585]
[586]
[587]
[588]
[589]
[590]
[591]
[592]
[593]
[594]
[595]
[596]
[597]
[598]
[599]
[600]
[601]
[602]
[603]
[604]
[605]
[606]
[607]
[608]
[609]
[610]
[611]
[612]
[613]
[614]
[615]
[616]
[617]
[618]
[619]
[620]
[621]
[622]
[623]
[624]
[625]
[626]
[627]
[628]
[629]
[630]
[631]
[632]
[633]
[634]
[635]
[636]
[637]
[638]
[639]
[640]
[641]
[642]
[643]
[644]
[645]
[646]
[647]
[648]
[649]
[650]
[651]
[652]
[653]
[654]
[655]
[656]
[657]
[658]
[659]
[660]
[661]
[662]
[663]
[664]
[665]
[666]
[667]
[668]
[669]
[670]
[671]
[672]
[673]
[674]
[675]
[676]
[677]
[678]
[679]
[680]
[681]
[682]
[683]
[684]
[685]
[686]
[687]
[688]
[689]
[690]
[691]
[692]
[693]
[694]
[695]
[696]
[697]
[698]
[699]
[700]
[701]
[702]
[703]
[704]
[705]
[706]
[707]
[708]
[709]
[710]
[711]
[712]
[713]
[714]
[715]
[716]
[717]
[718]
[719]
[720]
[721]
[722]
[723]
[724]
[725]
[726]
[727]
[728]
[729]
[730]
[731]
[732]
[733]
[734]
[735]
[736]
[737]
[738]
[739]
[740]
[741]
[742]
[743]
[744]
[745]
[746]
[747]
[748]
[749]
[750]
[751]
[752]
[753]
[754]
[755]
[756]
[757]
[758]
[759]
[760]
[761]
[762]
[763]
[764]
[765]
[766]
[767]
[768]
[769]
[770]
[771]
[772]
[773]
[774]
[775]
[776]
[777]
[778]
[779]
[780]
[781]
[782]
[783]
[784]
[785]
[786]
[787]
[788]
[789]
[790]
[791]
[792]
[793]
[794]
[795]
[796]
[797]
[798]
[799]
[800]
[801]
[802]
[803]
[804]
[805]
[806]
[807]
[808]
[809]
[810]
[811]
[812]
[813]
[814]
[815]
[816]
[817]
[818]
[819]
[820]
[821]
[822]
[823]
[824]
[825]
[826]
[827]
[828]
[829]
[830]
[831]
[832]
[833]
[834]
[835]
[836]
[837]
[838]
[839]
[840]
[841]
[842]
[843]
[844]
[845]
[846]
[847]
[848]
[849]
[850]
[851]
[852]
[853]
[854]
[855]
[856]
[857]
[858]
[859]
[860]
[861]
[862]
[863]
[864]
[865]
[866]
[867]
[868]
[869]
[870]
[871]
[872]
[873]
[874]
[875]
[876]
[877]
[878]
[879]
[880]
[881]
[882]
[883]
[884]
[885]
[886]
[887]
[888]
[889]
[890]
[891]
[892]
[893]
[894]
[895]
[896]
[897]
[898]
[899]
[900]
[901]
[902]
[903]
[904]
[905]
[906]
[907]
[908]
[909]
[910]
[911]
[912]
[913]
[914]
[915]
[916]
[917]
[918]
[919]
[920]
[921]
[922]
[923]
[924]
[925]
[926]
[927]
[928]
[929]
[930]
[931]
[932]
[933]
[934]
[935]
[936]
[937]
[938]
[939]
[940]
[941]
[942]
[943]
[944]
[945]
[946]
[947]
[948]
[949]
[950]
[951]
[952]
[953]
[954]
[955]
[956]
[957]
[958]
[959]
[960]
[961]
[962]
[963]
[964]
[965]
[966]
[967]
[968]
[969]
[970]
[971]
[972]
[973]
[974]
[975]
[976]
[977]
[978]
[979]
[980]
[981]
[982]
[983]
[984]
[985]
[986]
[987]
[988]
[989]
[990]
[991]
[992]
[993]
[994]
[995]
[996]
[997]
[998]
[999]
[1000]
[1001]
[1002]
[1003]
[1004]
[1005]
[1006]
[1007]
[1008]
[1009]
[1010]
[1011]
[1012]
[1013]
[1014]
[1015]
[1016]
[1017]
[1018]
[1019]
[1020]
[1021]
[1022]
[1023]
[1024]
[1025]
[1026]
[1027]
[1028]
[1029]
[1030]
[1031]
[1032]
[1033]
[1034]
[1035]
[1036]
[1037]
[1038]
[1039]
[1040]
[1041]
[1042]
[1043]
[1044]
[1045]
[1046]
[1047]
[1048]
[1049]
[1050]
[1051]
[1052]
[1053]
[1054]
[1055]
[1056]
[1057]
[1058]
[1059]
[1060]
[1061]
[1062]
[1063]
[1064]
[1065]
[1066]
[1067]
[1068]
[1069]
[1070]
[1071]
[1072]
[1073]
[1074]
[1075]
[1076]
[1077]
[1078]
[1079]
[1080]
[1081]
[1082]
[1083]
[1084]
[1085]
[1086]
[1087]
[1088]
[1089]
[1090]
[1091]
[1092]
[1093]
[1094]
[1095]
[1096]
[1097]
[1098]
[1099]
[1100]
[1101]
[1102]
[1103]
[1104]
[1105]
[1106]
[1107]
[1108]
[1109]
[1110]
[1111]
[1112]
[1113]
[1114]
[1115]
[1116]
[1117]
[1118]
[1119]
[1120]
[1121]
[1122]
[1123]
[1124]
[1125]
[1126]
[1127]
[1128]
[1129]
[1130]
[1131]
[1132]
[1133]
[1134]
[1135]
[1136]
[1137]
[1138]
[1139]
[1140]
[1141]
[1142]
[1143]
[1144]
[1145]
[1146]
[1147]
[1148]
[1149]
[1150]
[1151]
[1152]
[1153]
[1154]
[1155]
[1156]
[1157]
[1158]
[1159]
[1160]
[1161]
[1162]
[1163]
[1164]
[1165]
[1166]
[1167]
[1168]
[1169]
[1170]
[1171]
[1172]
[1173]
[1174]
[1175]
[1176]
[1177]
[1178]
[1179]
[1180]
[1181]
[1182]
[1183]
[1184]
[1185]
[1186]
[1187]
[1188]
[1189]
[1190]
[1191]
[1192]
[1193]
[1194]
[1195]
[1196]
[1197]
[1198]
[1199]
[1200]
[1201]
[1202]
[1203]
[1204]
[1205]
[1206]
[1207]
[1208]
[1209]
[1210]
[1211]
[1212]
[1213]
[1214]
[1215]
[1216]
[1217]
[1218]
[1219]
[1220]
[1221]
[1222]
[1223]
[1224]
[1225]
[1226]
[1227]
[1228]
[1229]
[1230]
[1231]
[1232]
[1233]
[1234]
[1235]
[1236]
[1237]
[1238]
[1239]
[1240]
[1241]
[1242]
[1243]
[1244]
[1245]
[1246]
[1247]
[1248]
[1249]
[1250]
[1251]
[1252]
[1253]
[1254]
[1255]
[1256]
[1257]
[1258]
[1259]
[1260]
[1261]
[1262]
[1263]
[1264]
[1265]
[1266]
[1267]
[1268]
[1269]
[1270]
[1271]
[1272]
[1273]
[1274]
[1275]
[1276]
[1277]
[1278]
[1279]
[1280]
[1281]
[1282]
[1283]
[1284]
[1285]
[1286]
[1287]
[1288]
[1289]
[1290]
[1291]
[1292]
[1293]
[1294]
[1295]
[1296]
[1297]
[1298]
[1299]
[1300]
[1301]
[1302]
[1303]
[1304]
[1305]
[1306]
[1307]
[1308]
[1309]
[1310]
[1311]
[1312]
[1313]
[1314]
[1315]
[1316]
[1317]
[1318]
[1319]
[1320]
[1321]
[1322]
[1323]
[1324]
[1325]
[1326]
[1327]
[1328]
[1329]
[1330]
[1331]
[1332]
[1333]
[1334]
[1335]
[1336]
[1337]
[1338]
[1339]
[1340]
[1341]
[1342]
[1343]
[1344]
[1345]
[1346]
[1347]
[1348]
[1349]
[1350]
[1351]
[1352]
[1353]
[1354]
[1355]
[1356]
[1357]
[1358]
[1359]
[1360]
[1361]
[1362]
[1363]
[1364]
[1365]
[1366]
[1367]
[1368]
[1369]
[1370]
[1371]
[1372]
[1373]
[1374]
[1375]
[1376]
[1377]
[1378]
[1379]
[1380]
[1381]
[1382]
[1383]
[1384]
[1385]
[1386]
[1387]
[1388]
[1389]
[1390]
[1391]
[1392]
[1393]
[1394]
[1395]
[1396]
[1397]
[1398]
[1399]
[1400]
[1401]
[1402]
[1403]
[1404]
[1405]
[1406]
[1407]
[1408]
[1409]
[1410]
[1411]
[1412]
[1413]
[1414]
[1415]
[1416]
[1417]
[1418]
[1419]
[1420]
[1421]
[1422]
[1423]
[1424]
[1425]
[1426]
[1427]
[1428]
[1429]
[1430]
[1431]
[1432]
[1433]
[1434]
[1435]
[1436]
[1437]
[1438]
[1439]
[1440]
[1441]
[1442]
[1443]
[1444]
[1445]
[1446]
[1447]
[1448]
[1449]
[1450]
[1451]
[1452]
[1453]
[1454]
[1455]
[1456]
[1457]
[1458]
[1459]
[1460]
[1461]
[1462]
[1463]
[1464]
[1465]
[1466]
[1467]
[1468]
[1469]
[1470]
[1471]
[1472]
[1473]
[1474]
[1475]
[1476]
[1477]
[1478]
[1479]
[1480]
[1481]
[1482]
[1483]
[1484]
[1485]
[1486]
[1487]
[1488]
[1489]
[1490]
[1491]
[1492]
[1493]
[1494]
[1495]
[1496]
[1497]
[1498]
[1499]
[1500]
[1501]
[1502]
[1503]
[1504]
[1505]
[1506]
[1507]
[1508]
[1509]
[1510]
[1511]
[1512]
[1513]
[1514]
[1515]
[1516]
[1517]
[1518]
[1519]
[1520]
[1521]
[1522]
[1523]
[1524]
[1525]
[1526]
[1527]
[1528]
[1529]
[1530]
[1531]
[1532]
[1533]
[1534]
[1535]
[1536]
[1537]
[1538]
[1539]
[1540]
[1541]
[1542]
[1543]
[1544]
[1545]
[1546]
[1547]
[1548]
[1549]
[1550]
[1551]
[1552]
[1553]
[1554]
[1555]
[1556]
[1557]
[1558]
[1559]
[1560]
[1561]
[1562]
[1563]
[1564]
[1565]
[1566]
[1567]
[1568]
[1569]
[1570]
[1571]
[1572]
[1573]
[1574]
[1575]
[1576]
[1577]
[1578]
[1579]
[1580]
[1581]
[1582]
[1583]
[1584]
[1585]
[1586]
[1587]
[1588]
[1589]
[1590]
[1591]
[1592]
[1593]
[1594]
[1595]
[1596]
[1597]
[1598]
[1599]
[1600]
[1601]
[1602]
[1603]
[1604]
[1605]
[1606]
[1607]
[1608]
[1609]
[1610]
[1611]
[1612]
[1613]
[1614]
[1615]
[1616]
[1617]
[1618]
[1619]
[1620]
[1621]
[1622]
[1623]
[1624]
[1625]
[1626]
[1627]
[1628]
[1629]
[1630]
[1631]
[1632]
[1633]
[1634]
[1635]
[1636]
[1637]
[1638]
[1639]
[1640]
[1641]
[1642]
[1643]
[1644]
[1645]
[1646]
[1647]
[1648]
[1649]
[1650]
[1651]
[1652]
[1653]
[1654]
[1655]
[1656]
[1657]
[1658]
[1659]
[1660]
[1661]
[1662]
[1663]
[1664]
[1665]
[1666]
[1667]
[1668]
[1669]
[1670]
[1671]
[1672]
[1673]
[1674]
[1675]
[1676]
[1677]
[1678]
[1679]
[1680]
[1681]
[1682]
[1683]
[1684]
[1685]
[1686]
[1687]
[1688]
[1689]
[1690]
[1691]
[1692]
[1693]
[1694]
[1695]
[1696]
[1697]
[1698]
[1699]
[1700]
[1701]
[1702]
[1703]
[1704]
[1705]
[1706]
[1707]
[1708]
[1709]
[1710]
[1711]
[1712]
[1713]
[1714]
[1715]
[1716]
[1717]
[1718]
[1719]
[1720]
[1721]
[1722]
[1723]
[1724]
[1725]
[1726]
[1727]
[1728]
[1729]
[1730]
[1731]
[1732]
[1733]
[1734]
[1735]
[1736]
[1737]
[1738]
[1739]
[1740]
[1741]
[1742]
[1743]
[1744]
[1745]
[1746]
[1747]
[1748]
[1749]
[1750]
[1751]
[1752]
[1753]
[1754]
[1755]
[1756]
[1757]
[1758]
[1759]
[1760]
[1761]
[1762]
[1763]
[1764]
[1765]
[1766]
[1767]
[1768]
[1769]
[1770]
[1771]
[1772]
[1773]
[1774]
[1775]
[1776]
[1777]
[1778]
[1779]
[1780]
[1781]
[1782]
[1783]
[1784]
[1785]
[1786]
[1787]
[1788]
[1789]
[1790]
[1791]
[1792]
[1793]
[1794]
[1795]
[1796]
[1797]
[1798]
[1799]
[1800]
[1801]
[1802]
[1803]
[1804]
[1805]
[1806]
[1807]
[1808]
[1809]
[1810]
[1811]
[1812]
[1813]
[1814]
[1815]
[1816]
[1817]
[1818]
[1819]
[1820]
[1821]
[1822]
[1823]
[1824]
[1825]
[1826]
[1827]
[1828]
[1829]
[1830]
[1831]
[1832]
[1833]
[1834]
[1835]
[1836]
[1837]
[1838]
[1839]
[1840]
[1841]
[1842]
[1843]
[1844]
[1845]
[1846]
[1847]
[1848]
[1849]
[1850]
[1851]
[1852]
[1853]
[1854]
[1855]
[1856]
[1857]
[1858]
[1859]
[1860]
[1861]
[1862]
[1863]
[1864]
[1865]
[1866]
[1867]
[1868]
[1869]
[1870]
[1871]
[1872]
[1873]
[1874]
[1875]
[1876]
[1877]
[1878]
[1879]
[1880]
[1881]
[1882]
[1883]
[1884]
[1885]
[1886]
[1887]
[1888]
[1889]
[1890]
[1891]
[1892]
[1893]
[1894]
[1895]
[1896]
[1897]
[1898]
[1899]
[1900]
[1901]
[1902]
[1903]
[1904]
[1905]
[1906]
[1907]
[1908]
[1909]
[1910]
[1911]
[1912]
[1913]
[1914]
[1915]
[1916]
[1917]
[1918]
[1919]
[1920]
[1921]
[1922]
[1923]
[1924]
[1925]
[1926]
[1927]
[1928]
[1929]
[1930]
[1931]
[1932]
[1933]
[1934]
[1935]
[1936]
[1937]
[1938]
[1939]
[1940]
[1941]
[1942]
[1943]
[1944]
[1945]
[1946]
[1947]
[1948]
[1949]
[1950]
[1951]
[1952]
[1953]
[1954]
[1955]
[1956]
[1957]
[1958]
[1959]
[1960]
[1961]
[1962]
[1963]
[1964]
[1965]
[1966]
[1967]
[1968]
[1969]
[1970]
[1971]
[1972]
[1973]
[1974]
[1975]
[1976]
[1977]
[1978]
[1979]
[1980]
[1981]
[1982]
[1983]
[1984]
[1985]
[1986]
[1987]
[1988]
[1989]
[1990]
[1991]
[1992]
[1993]
[1994]
[1995]
[1996]
[1997]
[1998]
[1999]
[2000]
[2001]
[2002]
[2003]
[2004]
[2005]
[2006]
[2007]
[2008]
[2009]
[2010]
[2011]
[2012]
[2013]
[2014]
[2015]
[2016]
[2017]
[2018]
[2019]
[2020]
[2021]
[2022]
[2023]
[2024]
[2025]
[2026]
[2027]
[2028]
[2029]
[2030]
[2031]
[2032]
[2033]
[2034]
[2035]
[2036]
[2037]
[2038]
[2039]
[2040]
[2041]
[2042]
[2043]
[2044]
[2045]
[2046]
[2047]
[2048]
[2049]
[2050]
[2051]
[2052]
[2053]
[2054]
[2055]
[2056]
[2057]
[2058]
[2059]
[2060]
[2061]
[2062]
[2063]
[2064]
[2065]
[2066]
[2067]
[2068]
[2069]
[2070]
[2071]
[2072]
[2073]
[2074]
[2075]
[2076]
[2077]
[2078]
[2079]
[2080]
[2081]
[2082]
[2083]
[2084]
[2085]
[2086]
[2087]
[2088]
[2089]
[2090]
[2091]
[2092]
[2093]
[2094]
[2095]
[2096]
[2097]
[2098]
[2099]
[2100]
[2101]
[2102]
[2103]
[2104]
[2105]
[2106]
[2107]
[2108]
[2109]
[2110]
[2111]
[2112]
[2113]
[2114]
[2115]
[2116]
[2117]
[2118]
[2119]
[2120]
[2121]
[2122]
[2123]
[2124]
[2125]
[2126]
[2127]
[2128]
[2129]
[2130]
[2131]
[2132]
[2133]
[2134]
[2135]
[2136]
[2137]
[2138]
[2139]
[2140]
[2141]
[2142]
[2143]
[2144]
[2145]
[2146]
[2147]
[2148]
[2149]
[2150]
[2151]
[2152]
[2153]
[2154]
[2155]
[2156]
[2157]
[2158]
[2159]
[2160]
[2161]
[2162]
[2163]
[2164]
[2165]
[2166]
[2167]
[2168]
[2169]
[2170]
[2171]
[2172]
[2173]
[2174]
[2175]
[2176]
[2177]
[2178]
[2179]
[2180]
[2181]
[2182]
[2183]
[2184]
[2185]
[2186]
[2187]
[2188]
[2189]
[2190]
[2191]
[2192]
[2193]
[2194]
[2195]
[2196]
[2197]
[2198]
[2199]
[2200]
[2201]
[2202]
[2203]
[2204]
[2205]
[2206]
[2207]
[2208]
[2209]
[2210]
[2211]
[2212]
[2213]
[2214]
[2215]
[2216]
[2217]
[2218]
[2219]
[2220]
[2221]
[2222]
[2223]
[2224]
[2225]
[2226]
[2227]
[2228]
[2229]
[2230]
[2231]
[2232]
[2233]
[2234]
[2235]
[2236]
[2237]
[2238]
[2239]
[2240]
[2241]
[2242]
[2243]
[2244]
[2245]
[2246]
[2247]
[2248]
[2249]
[2250]
[2251]
[2252]
[2253]
[2254]
[2255]
[2256]
[2257]
[2258]
[2259]
[2260]
[2261]
[2262]
[2263]
[2264]
[2265]
[2266]
[2267]
[2268]
[2269]
[2270]
[2271]
[2272]
[2273]
[2274]
[2275]
[2276]
[2277]
[2278]
[2279]
[2280]
[2281]
[2282]
[2283]
[2284]
[2285]
[2286]
[2287]
[2288]
[2289]
[2290]
[2291]
[2292]
[2293]
[2294]
[2295]
[2296]
[2297]
[2298]
[2299]
[2300]
[2301]
[2302]
[2303]
[2304]
[2305]
[2306]
[2307]
[2308]
[2309]
[2310]
[2311]
[2312]
[2313]
[2314]
[2315]
[2316]
[2317]
[2318]
[2319]
[2320]
[2321]
[2322]
[2323]
[2324]
[2325]
[2326]
[2327]
[2328]
[2329]
[2330]
[2331]
[2332]
[2333]
[2334]
[2335]
[2336]
[2337]
[2338]
[2339]
[2340]
[2341]
[2342]
[2343]
[2344]
[2345]
[2346]
[2347]
[2348]
[2349]
[2350]
[2351]
[2352]
[2353]
[2354]
[2355]
[2356]
[2357]
[2358]
[2359]
[2360]
[2361]
[2362]
[2363]
[2364]
[2365]
[2366]
[2367]
[2368]
[2369]
[2370]
[2371]
[2372]
[2373]
[2374]
[2375]
[2376]
[2377]
[2378]
[2379]
[2380]
[2381]
[2382]
[2383]
[2384]
[2385]
[2386]
[2387]
[2388]
[2389]
[2390]
[2391]
[2392]
[2393]
[2394]
[2395]
[2396]
[2397]
[2398]
[2399]
[2400]
[2401]
[2402]
[2403]
[2404]
[2405]
[2406]
[2407]
[2408]
[2409]
[2410]
[2411]
[2412]
[2413]
[2414]
[2415]
[2416]
[2417]
[2418]
[2419]
[2420]
[2421]
[2422]
[2423]
[2424]
[2425]
[2426]
[2427]
[2428]
[2429]
[2430]
[2431]
[2432]
[2433]
[2434]
[2435]
[2436]
[2437]
[2438]
[2439]
[2440]
[2441]
[2442]
[2443]
[2444]
[2445]
[2446]
[2447]
[2448]
[2449]
[2450]
[2451]
[2452]
[2453]
[2454]
[2455]
[2456]
[2457]
[2458]
[2459]
[2460]
[2461]
[2462]
[2463]
[2464]
[2465]
[2466]
[2467]
[2468]
[2469]
[2470]
[2471]
[2472]
[2473]
[2474]
[2475]
[2476]
[2477]
[2478]
[2479]
[2480]
[2481]
[2482]
[2483]
[2484]
[2485]
[2486]
[2487]
[2488]
[2489]
[2490]
[2491]
[2492]
[2493]
[2494]
[2495]
[2496]
[2497]
[2498]
[2499]
[2500]
[2501]
[2502]
[2503]
[2504]
[2505]
[2506]
[2507]
[2508]
[2509]
[2510]
[2511]
[2512]
[2513]
[2514]
[2515]
[2516]
[2517]
[2518]
[2519]
[2520]
[2521]
[2522]
[2523]
[2524]
[2525]
[2526]
[2527]
[2528]
[2529]
[2530]
[2531]
[2532]
[2533]
[2534]
[2535]
[2536]
[2537]
[2538]
[2539]
[2540]
[2541]
[2542]
[2543]
[2544]
[2545]
[2546]
[2547]
[2548]
[2549]
[2550]
[2551]
[2552]
[2553]
[2554]
[2555]
[2556]
[2557]
[2558]
[2559]
[2560]
[2561]
[2562]
[2563]
[2564]
[2565]
[2566]
[2567]
[2568]
[2569]
[2570]
[2571]
[2572]
[2573]
[2574]
[2575]
[2576]
[2577]
[2578]
[2579]
[2580]
[2581]
[2582]
[2583]
[2584]
[2585]
[2586]
[2587]
[2588]
[2589]
[2590]
[2591]
[2592]
[2593]
[2594]
[2595]
[2596]
[2597]
[2598]
[2599]
[2600]
[2601]
[2602]
[2603]
[2604]
[2605]
[2606]
[2607]
[2608]
[2609]
[2610]
[2611]
[2612]
[2613]
[2614]
[2615]
[2616]
[2617]
[2618]
[2619]
[2620]
[2621]
[2622]
[2623]
[2624]
[2625]
[2626]
[2627]
[2628]
[2629]
[2630]
[2631]
[2632]
[2633]
[2634]
[2635]
[2636]
[2637]
[2638]
[2639]
[2640]
[2641]
[2642]
[2643]
[2644]
[2645]
[2646]
[2647]
[2648]
[2649]
[2650]
[2651]
[2652]
[2653]
[2654]
[2655]
[2656]
[2657]
[2658]
[2659]
[2660]
[2661]
[2662]
[2663]
[2664]
[2665]
[2666]
[2667]
[2668]
[2669]
[2670]
[2671]
[2672]
[2673]
[2674]
[2675]
[2676]
[2677]
[2678]
[2679]
[2680]
[2681]
[2682]
[2683]
[2684]
[2685]
[2686]
[2687]
[2688]
[2689]
[2690]
[2691]
[2692]
[2693]
[2694]
[2695]
[2696]
[2697]
[2698]
[2699]
[2700]
[2701]
[2702]
[2703]
[2704]
[2705]
[2706]
[2707]
[2708]
[2709]
[2710]
[2711]
[2712]
[2713]
[2714]
[2715]
[2716]
[2717]
[2718]
[2719]
[2720]
[2721]
[2722]
[2723]
[2724]
[2725]
[2726]
[2727]
[2728]
[2729]
[2730]
[2731]
[2732]
[2733]
[2734]
[2735]
[2736]
[2737]
[2738]
[2739]
[2740]
[2741]
[2742]
[2743]
[2744]
[2745]
[2746]
[2747]
[2748]
[2749]
[2750]
[2751]
[2752]
[2753]
[2754]
[2755]
[2756]
[2757]
[2758]
[2759]
[2760]
[2761]
[2762]
[2763]
[2764]
[2765]
[2766]
[2767]
[2768]
[2769]
[2770]
[2771]
[2772]
[2773]
[2774]
[2775]
[2776]
[2777]
[2778]
[2779]
[2780]
[2781]
[2782]
[2783]
[2784]
[2785]
[2786]
[2787]
[2788]
[2789]
[2790]
[2791]
[2792]
[2793]
[2794]
[2795]
[2796]
[2797]
[2798]
[2799]
[2800]
[2801]
[2802]
[2803]
[2804]
[2805]
[2806]
[2807]
[2808]
[2809]
[2810]
[2811]
[2812]
[2813]
[2814]
[2815]
[2816]
[2817]
[2818]
[2819]
[2820]
[2821]
[2822]
[2823]
[2824]
[2825]
[2826]
[2827]
[2828]
[2829]
[2830]
[2831]
[2832]
[2833]
[2834]
[2835]
[2836]
[2837]
[2838]
[2839]
[2840]
[2841]
[2842]
[2843]
[2844]
[2845]
[2846]
[2847]
[2848]
[2849]
[2850]
[2851]
[2852]
[2853]
[2854]
[2855]
[2856]
[2857]
[2858]
[2859]
[2860]
[2861]
[2862]
[2863]
[2864]
[2865]
[2866]
[2867]
[2868]
[2869]
[2870]
[2871]
[2872]
[2873]
[2874]
[2875]
[2876]
[2877]
[2878]
[2879]
[2880]
[2881]
[2882]
[2883]
[2884]
[2885]
[2886]
[2887]
[2888]
[2889]
[2890]
[2891]
[2892]
[2893]
[2894]
[2895]
[2896]
[2897]
[2898]
[2899]
[2900]
[2901]
[2902]
[2903]
[2904]
[2905]
[2906]
[2907]
[2908]
[2909]
[2910]
[2911]
[2912]
[2913]
[2914]
[2915]
[2916]
[2917]
[2918]
[2919]
[2920]
[2921]
[2922]
[2923]
[2924]
[2925]
[2926]
[2927]
[2928]
[2929]
[2930]
[2931]
[2932]
[2933]
[2934]
[2935]
[2936]
[2937]
[2938]
[2939]
[2940]
[2941]
[2942]
[2943]
[2944]
[2945]
[2946]
[2947]
[2948]
[2949]
[2950]
[2951]
[2952]
[2953]
[2954]
[2955]
[2956]
[2957]
[2958]
[2959]
[2960]
[2961]
[2962]
[2963]
[2964]
[2965]
[2966]
[2967]
[2968]
[2969]
[2970]
[2971]
[2972]
[2973]
[2974]
[2975]
[2976]
[2977]
[2978]
[2979]
[2980]
[2981]
[2982]
[2983]
[2984]
[2985]
[2986]
[2987]
[2988]
[2989]
[2990]
[2991]
[2992]
[2993]
[2994]
[2995]
[2996]
[2997]
[2998]
[2999]
[3000]

{"sheet":"ExistingTx","index":7,"n_rows":3005,"n_cols":128,"rows_kept":3005,"cut":false,"hidden":false,"merged":[[0,0,3,0]]}
[null,null,null,"Projects Ranked for Existing Transmission",null,null,null,null,null,null,null,null,null,null,null,null,null,null,"Alberta","Arizona","Baja","Barstow","British Columbia","Carrizo North","Carrizo South","Colorado","Cuyama","Distributed Solar - PG&E","Distributed Solar - SCE","Distributed Solar - SDGE","Distributed Solar - Other","Fairmont","Imperial","Inyokern","Iron Mountain","Kramer","Lassen North","Lassen South","Montana","Mountain Pass","Nevada C","Nevada N","New Mexico","NonCREZ","Northwest","Owens Valley","Palm Springs","Pisgah","Remote DG (Easy) - PG&E","Remote DG (Easy) - SCE","Remote DG (Easy) - SDGE","Remote DG (Easy) - Other","Remote DG (Hard) - PG&E","Remote DG (Hard) - SCE","Remote DG (Hard) - SDGE","Remote DG (Hard) - Other","Riverside East","Round Mountain","San Bernardino - Baker","San Bernardino - Lucerne","San Diego North Central","San Diego South","Santa Barbara","Solano","Tehachapi","Twentynine Palms","Utah-Southern Idaho","Victorville","Westlands","Wyoming","Central Valley North","El Dorado","Merced","Los Banos"]
[null,null,null,"Discounted Core Projects Ranked for Existing Transmission",null,null,null,null,null,null,null,null,null,null,null,null,null,"MW Available - Existing Tx (No Upgrades)",null,null,null,null,null,null,null,null,null,null,null,null,null,null,null,null,null,null,null,null,null,null,null,null,null,null,null,null,null,null,null,null,null,null,null,null,null,null,null,null,null,null,null,null,null,null,null,null,null,null,null,null,null,null,null,null,null,"Selected for Delivery on Existing Transmission ",null,null,"Delivered to Load on Existing Transmission ",null,null,null,null,"Selected for Delivery on Minor Upgrades",null,null,"Delivered to Load on Minor Upgrades",null,null,null,null,"Delivered to Interim Zone",null,null,null,"Remaining for Export"]
[null,null,null,null,null,null,null,null,null,null,null,null,null,null,null,null,null,"MW Available w/ Minor Upgrades"]
[null,null,null,null,null,null,null,null,null,null,null,null,null,null,null,null,null,"Total Tx Capacity (MW)"]
["Rank",null,"ID#","Resource ID","Type","Resource Locator","Discounted Core","MW","Dependable MW","GWh",null,"Region","Resource Zone","RA Zone","First Segment Losses","Shared Transmission Zone","Second Segment Losses (where applicable)","Cumulative MW Selected by CREZ",0,0,0,0,0,0,0,0,0,0,0,0,0,0,0,0,0,0,0,0,0,0,0,0,0,0,0,0,0,0,0,0,0,0,0,0,0,0,0,0,0,0,0,0,0,0,0,0,0,0,0,0,0,0,0,0,null,"Nameplate MW","GWh",null,"MW","Delivered MW","GWh","RECs",null,"Nameplate MW","GWh",null,"MW","Delivered MW","GWh","RECs",null,"MW","GWh","RECs",null,"MW","GWh",null,"Available Date","Available Date",null,"Busbar Cost (LCOE, $/MWh)","Integration Costs ($/MWh)","Distribution System Benefits ($/MWh)",null,"Capacity Value - CA Delivery","Energy Value - CA Delivery",null,"Transmission Cost",null,"Ranking Cost (Existing Tx)",null,"Cost Score (Existing Transmission)","Environmental Score","Environmental Score","Commercial Interest Score","Time Score (Existing Transmission)","Time Score (Incremental Upgrades)",null,"Weighted Score - Delivered to Load"]
[1]
[2]
[3]
[4]
[5]
[6]
[7]
[8]
[9]
[10]
[11]
[12]
[13]
[14]
[15]
[16]
[17]
[18]
[19]
[20]
[21]
[22]
[23]
[24]
[25]
[26]
[27]
[28]
[29]
[30]
[31]
[32]
[33]
[34]
[35]
[36]
[37]
[38]
[39]
[40]
[41]
[42]
[43]
[44]
[45]
[46]
[47]
[48]
[49]
[50]
[51]
[52]
[53]
[54]
[55]
[56]
[57]
[58]
[59]
[60]
[61]
[62]
[63]
[64]
[65]
[66]
[67]
[68]
[69]
[70]
[71]
[72]
[73]
[74]
[75]
[76]
[77]
[78]
[79]
[80]
[81]
[82]
[83]
[84]
[85]
[86]
[87]
[88]
[89]
[90]
[91]
[92]
[93]
[94]
[95]
[96]
[97]
[98]
[99,null,null,null,null,null,null,null,null,null,null,null,null,null,null,null,null,null,null,null,null,null,null,null,null,null,null,null,null,null,null,null,null,null,null,null,null,null,null,null,null,null,null,null,null,null,null,null,null,null,null,null,null,null,null,null,null,null,null,null,null,null,null,null,null,null,null,null,null,null,null,null,null,null,null,null,null,null,null,null,null,null,null,null,null,null,null,null,null,null,null,null,null,null,null,null,null,null,null,null,null,null,null,null,null,null,null,null,null,null,null,null,null,null,null,null,null,null,null,null,null,null,{"$error":"#REF!"},{"$error":"#REF!"},{"$error":"#REF!"},{"$error":"#REF!"},{"$error":"#REF!"},{"$error":"#REF!"}]
[100,null,null,null,null,null,null,null,null,null,null,null,null,null,null,null,null,null,null,null,null,null,null,null,null,null,null,null,null,null,null,null,null,null,null,null,null,null,null,null,null,null,null,null,null,null,null,null,null,null,null,null,null,null,null,null,null,null,null,null,null,null,null,null,null,null,null,null,null,null,null,null,null,null,null,null,null,null,null,null,null,null,null,null,null,null,null,null,null,null,null,null,null,null,null,null,null,null,null,null,null,null,null,null,null,null,null,null,null,null,null,null,null,null,null,null,null,null,null,null,null,null,{"$error":"#REF!"},{"$error":"#REF!"},{"$error":"#REF!"},{"$error":"#REF!"},{"$error":"#REF!"}]
[101]
[102,null,null,null,null,null,null,null,null,null,null,null,null,null,null,null,null,null,null,null,null,null,null,null,null,null,null,null,null,null,null,null,null,null,null,null,null,null,null,null,null,null,null,null,null,null,null,null,null,null,null,null,null,null,null,null,null,null,null,null,null,null,null,null,null,null,null,null,null,null,null,null,null,null,null,null,null,null,null,null,null,null,null,null,null,null,null,null,null,null,null,null,null,null,null,null,null,null,null,null,null,null,null,null,null,null,null,null,null,null,null,null,null,null,null,null,null,null,null,null,null,null,{"$error":"#REF!"},{"$error":"#REF!"},{"$error":"#REF!"},{"$error":"#REF!"},{"$error":"#REF!"}]
[103,null,null,null,null,null,null,null,null,null,null,null,null,null,null,null,null,null,null,null,null,null,null,null,null,null,null,null,null,null,null,null,null,null,null,null,null,null,null,null,null,null,null,null,null,null,null,null,null,null,null,null,null,null,null,null,null,null,null,null,null,null,null,null,null,null,null,null,null,null,null,null,null,null,null,null,null,null,null,null,null,null,null,null,null,null,null,null,null,null,null,null,null,null,null,null,null,null,null,null,null,null,null,null,null,null,null,null,null,null,null,null,null,null,null,null,null,null,null,null,null,null,{"$error":"#REF!"},{"$error":"#REF!"},{"$error":"#REF!"},{"$error":"#REF!"},{"$error":"#REF!"}]
[104]
[105]
[106]
[107]
[108]
[109]
[110]
[111]
[112]
[113]
[114]
[115]
[116]
[117]
[118]
[119]
[120]
[121]
[122]
[123]
[124]
[125]
[126]
[127]
[128]
[129]
[130]
[131]
[132]
[133]
[134]
[135]
[136]
[137]
[138]
[139]
[140]
[141]
[142]
[143]
[144]
[145]
[146]
[147]
[148]
[149]
[150]
[151]
[152]
[153]
[154]
[155]
[156]
[157]
[158]
[159]
[160]
[161]
[162]
[163]
[164]
[165]
[166]
[167]
[168]
[169]
[170]
[171]
[172]
[173]
[174]
[175]
[176]
[177]
[178]
[179]
[180]
[181]
[182]
[183]
[184]
[185]
[186]
[187]
[188]
[189]
[190]
[191]
[192]
[193]
[194]
[195]
[196]
[197]
[198]
[199]
[200]
[201]
[202]
[203]
[204]
[205]
[206]
[207]
[208]
[209]
[210]
[211]
[212]
[213]
[214]
[215]
[216]
[217]
[218]
[219]
[220]
[221]
[222]
[223]
[224]
[225]
[226]
[227]
[228]
[229]
[230]
[231]
[232]
[233]
[234]
[235]
[236]
[237]
[238]
[239]
[240]
[241]
[242]
[243]
[244]
[245]
[246]
[247]
[248]
[249]
[250]
[251]
[252]
[253]
[254]
[255]
[256]
[257]
[258]
[259]
[260]
[261]
[262]
[263]
[264]
[265]
[266]
[267]
[268]
[269]
[270]
[271]
[272]
[273]
[274]
[275]
[276]
[277]
[278]
[279]
[280]
[281]
[282]
[283]
[284]
[285]
[286]
[287]
[288]
[289]
[290]
[291]
[292]
[293]
[294]
[295]
[296]
[297]
[298]
[299]
[300]
[301]
[302]
[303]
[304]
[305]
[306]
[307]
[308]
[309]
[310]
[311]
[312]
[313]
[314]
[315]
[316]
[317]
[318]
[319]
[320]
[321]
[322]
[323]
[324]
[325]
[326]
[327]
[328]
[329]
[330]
[331]
[332]
[333]
[334]
[335]
[336]
[337]
[338]
[339]
[340]
[341]
[342]
[343]
[344]
[345]
[346]
[347]
[348]
[349]
[350]
[351]
[352]
[353]
[354]
[355]
[356]
[357]
[358]
[359]
[360]
[361]
[362]
[363,null,null,null,null,null,null,null,null,null,null,null,null,null,null,null,null,null,null,null,null,null,null,null,null,null,null,null,null,null,null,null,null,null,null,null,null,null,null,null,null,null,null,null,null,null,null,null,null,null,null,null,null,null,null,null,null,null,null,null,null,null,null,null,null,null,null,null,null,null,null,null,null,null,null,null,null,null,null,null,null,null,null,null,null,null,null,null,null,null,null,null,null,null,null,null,null,null,null,null,null,null,null,null,null,null,null,null,null,null,null,null,null,null,null,null,null,null,null,null,null,{"$error":"#REF!"}]
[364,null,null,null,null,null,null,null,null,null,null,null,null,null,null,null,null,null,null,null,null,null,null,null,null,null,null,null,null,null,null,null,null,null,null,null,null,null,null,null,null,null,null,null,null,null,null,null,null,null,null,null,null,null,null,null,null,null,null,null,null,null,null,null,null,null,null,null,null,null,null,null,null,null,null,null,null,null,null,null,null,null,null,null,null,null,null,null,null,null,null,null,null,null,null,null,null,null,null,null,null,null,null,null,null,null,null,null,null,null,null,null,null,null,null,null,null,null,null,null,{"$error":"#REF!"},{"$error":"#REF!"},{"$error":"#REF!"},{"$error":"#REF!"},{"$error":"#REF!"},{"$error":"#REF!"}]
[365]
[366]
[367]
[368]
[369]
[370]
[371]
[372]
[373]
[374]
[375]
[376]
[377]
[378]
[379]
[380]
[381]
[382]
[383]
[384]
[385]
[386]
[387]
[388]
[389]
[390]
[391]
[392]
[393]
[394]
[395]
[396]
[397]
[398]
[399]
[400]
[401]
[402]
[403]
[404]
[405]
[406]
[407]
[408]
[409]
[410]
[411]
[412]
[413]
[414]
[415]
[416]
[417]
[418]
[419]
[420]
[421]
[422]
[423]
[424]
[425]
[426]
[427]
[428]
[429]
[430]
[431]
[432]
[433]
[434]
[435]
[436]
[437]
[438]
[439]
[440]
[441]
[442]
[443]
[444]
[445]
[446]
[447]
[448]
[449]
[450]
[451]
[452]
[453]
[454]
[455]
[456]
[457]
[458]
[459]
[460]
[461]
[462]
[463]
[464]
[465]
[466]
[467]
[468]
[469]
[470]
[471]
[472]
[473]
[474]
[475]
[476]
[477]
[478]
[479]
[480]
[481]
[482]
[483]
[484]
[485]
[486]
[487]
[488]
[489]
[490]
[491]
[492]
[493]
[494]
[495]
[496]
[497]
[498]
[499]
[500]
[501]
[502]
[503]
[504]
[505]
[506]
[507]
[508]
[509]
[510]
[511]
[512,null,null,null,null,null,null,null,null,null,null,null,null,null,null,null,null,null,null,null,null,null,null,null,null,null,null,null,null,null,null,null,null,null,null,null,null,null,null,null,null,null,null,null,null,null,null,null,null,null,null,null,null,null,null,null,null,null,null,null,null,null,null,null,null,null,null,null,null,null,null,null,null,null,null,null,null,null,null,null,null,null,null,null,null,null,null,null,null,null,null,null,null,null,null,null,null,null,null,null,null,null,null,null,null,null,null,null,null,null,null,null,null,null,null,null,null,null,null,null,null,null,{"$error":"#REF!"},{"$error":"#REF!"},{"$error":"#REF!"},{"$error":"#REF!"},{"$error":"#REF!"},{"$error":"#REF!"}]
[513]
[514]
[515]
[516]
[517]
[518]
[519]
[520]
[521]
[522]
[523]
[524]
[525]
[526]
[527]
[528]
[529]
[530]
[531]
[532]
[533]
[534]
[535]
[536]
[537]
[538]
[539]
[540]
[541]
[542]
[543]
[544]
[545]
[546]
[547]
[548]
[549]
[550]
[551]
[552]
[553]
[554]
[555]
[556]
[557]
[558]
[559]
[560]
[561]
[562]
[563]
[564]
[565]
[566]
[567]
[568]
[569]
[570]
[571]
[572]
[573]
[574]
[575]
[576]
[577]
[578]
[579]
[580]
[581]
[582]
[583]
[584]
[585]
[586]
[587]
[588]
[589]
[590]
[591]
[592]
[593]
[594]
[595]
[596]
[597]
[598]
[599]
[600]
[601]
[602]
[603]
[604]
[605]
[606]
[607]
[608]
[609]
[610]
[611]
[612]
[613]
[614]
[615]
[616]
[617]
[618]
[619]
[620]
[621]
[622]
[623]
[624]
[625]
[626]
[627]
[628]
[629]
[630]
[631]
[632]
[633]
[634]
[635]
[636]
[637]
[638]
[639]
[640]
[641]
[642]
[643]
[644]
[645]
[646]
[647]
[648]
[649]
[650]
[651]
[652]
[653]
[654]
[655]
[656]
[657]
[658]
[659]
[660]
[661]
[662]
[663]
[664]
[665]
[666]
[667]
[668]
[669]
[670]
[671]
[672]
[673]
[674]
[675]
[676]
[677]
[678]
[679]
[680]
[681]
[682]
[683]
[684]
[685]
[686]
[687]
[688]
[689]
[690]
[691]
[692]
[693]
[694]
[695]
[696]
[697]
[698]
[699]
[700]
[701]
[702]
[703]
[704]
[705]
[706]
[707]
[708]
[709]
[710]
[711]
[712]
[713]
[714]
[715]
[716]
[717]
[718]
[719]
[720]
[721]
[722]
[723]
[724]
[725]
[726]
[727]
[728]
[729]
[730]
[731]
[732]
[733]
[734]
[735]
[736]
[737]
[738]
[739]
[740]
[741]
[742]
[743]
[744]
[745]
[746]
[747]
[748]
[749]
[750]
[751]
[752]
[753]
[754]
[755]
[756]
[757]
[758]
[759]
[760]
[761]
[762]
[763]
[764]
[765]
[766]
[767]
[768]
[769]
[770]
[771]
[772]
[773]
[774]
[775]
[776]
[777]
[778]
[779]
[780]
[781]
[782]
[783]
[784]
[785]
[786]
[787]
[788]
[789]
[790]
[791]
[792]
[793]
[794]
[795]
[796]
[797]
[798]
[799]
[800]
[801]
[802]
[803]
[804]
[805]
[806]
[807]
[808]
[809]
[810]
[811]
[812]
[813]
[814]
[815]
[816]
[817]
[818]
[819]
[820]
[821]
[822]
[823]
[824]
[825]
[826]
[827]
[828]
[829]
[830]
[831]
[832]
[833]
[834]
[835]
[836]
[837]
[838]
[839]
[840]
[841]
[842]
[843]
[844]
[845]
[846]
[847]
[848]
[849]
[850]
[851]
[852]
[853]
[854]
[855]
[856]
[857]
[858]
[859]
[860]
[861]
[862]
[863]
[864]
[865]
[866]
[867]
[868]
[869]
[870]
[871]
[872]
[873]
[874]
[875]
[876]
[877]
[878]
[879]
[880]
[881]
[882]
[883]
[884]
[885]
[886]
[887]
[888]
[889]
[890]
[891]
[892]
[893]
[894]
[895]
[896]
[897]
[898]
[899]
[900]
[901]
[902]
[903]
[904]
[905]
[906]
[907]
[908]
[909]
[910]
[911]
[912]
[913]
[914]
[915]
[916]
[917]
[918]
[919]
[920]
[921]
[922]
[923]
[924]
[925]
[926]
[927]
[928]
[929]
[930]
[931]
[932]
[933]
[934]
[935]
[936]
[937]
[938]
[939]
[940]
[941]
[942]
[943]
[944]
[945]
[946]
[947]
[948]
[949]
[950]
[951]
[952]
[953]
[954]
[955]
[956]
[957]
[958]
[959]
[960]
[961]
[962]
[963]
[964]
[965]
[966]
[967]
[968]
[969]
[970]
[971]
[972]
[973]
[974]
[975]
[976]
[977]
[978]
[979]
[980]
[981]
[982]
[983]
[984]
[985]
[986]
[987]
[988]
[989]
[990]
[991]
[992]
[993]
[994]
[995]
[996]
[997]
[998]
[999]
[1000]
[1001]
[1002]
[1003]
[1004]
[1005]
[1006]
[1007]
[1008]
[1009]
[1010]
[1011]
[1012]
[1013]
[1014]
[1015]
[1016]
[1017]
[1018]
[1019]
[1020]
[1021]
[1022]
[1023]
[1024]
[1025]
[1026]
[1027]
[1028]
[1029]
[1030]
[1031]
[1032]
[1033]
[1034]
[1035]
[1036]
[1037]
[1038]
[1039]
[1040]
[1041]
[1042]
[1043]
[1044]
[1045]
[1046]
[1047]
[1048]
[1049]
[1050]
[1051]
[1052]
[1053]
[1054]
[1055]
[1056]
[1057]
[1058]
[1059]
[1060]
[1061]
[1062]
[1063]
[1064]
[1065]
[1066]
[1067]
[1068]
[1069]
[1070]
[1071]
[1072]
[1073]
[1074]
[1075]
[1076]
[1077]
[1078]
[1079]
[1080]
[1081]
[1082]
[1083]
[1084]
[1085]
[1086]
[1087]
[1088]
[1089]
[1090]
[1091]
[1092]
[1093]
[1094]
[1095]
[1096]
[1097]
[1098]
[1099]
[1100]
[1101]
[1102]
[1103]
[1104]
[1105]
[1106]
[1107]
[1108]
[1109]
[1110]
[1111]
[1112]
[1113]
[1114]
[1115]
[1116]
[1117]
[1118]
[1119]
[1120]
[1121]
[1122]
[1123]
[1124]
[1125]
[1126]
[1127]
[1128]
[1129]
[1130]
[1131]
[1132]
[1133]
[1134]
[1135]
[1136]
[1137]
[1138]
[1139]
[1140]
[1141]
[1142]
[1143]
[1144]
[1145]
[1146]
[1147]
[1148]
[1149]
[1150]
[1151]
[1152]
[1153]
[1154]
[1155]
[1156]
[1157]
[1158]
[1159]
[1160]
[1161]
[1162]
[1163]
[1164]
[1165]
[1166]
[1167]
[1168]
[1169]
[1170]
[1171]
[1172]
[1173]
[1174]
[1175]
[1176]
[1177]
[1178]
[1179]
[1180]
[1181]
[1182]
[1183]
[1184]
[1185]
[1186]
[1187]
[1188]
[1189]
[1190]
[1191]
[1192]
[1193]
[1194]
[1195]
[1196]
[1197]
[1198]
[1199]
[1200]
[1201]
[1202]
[1203]
[1204]
[1205]
[1206]
[1207]
[1208]
[1209]
[1210]
[1211]
[1212]
[1213]
[1214]
[1215]
[1216]
[1217]
[1218]
[1219]
[1220]
[1221]
[1222]
[1223]
[1224]
[1225]
[1226]
[1227]
[1228]
[1229]
[1230]
[1231]
[1232]
[1233]
[1234]
[1235]
[1236]
[1237]
[1238]
[1239]
[1240]
[1241]
[1242]
[1243]
[1244]
[1245]
[1246]
[1247]
[1248]
[1249]
[1250]
[1251]
[1252]
[1253]
[1254]
[1255]
[1256]
[1257]
[1258]
[1259]
[1260]
[1261]
[1262]
[1263]
[1264]
[1265]
[1266]
[1267]
[1268]
[1269]
[1270]
[1271]
[1272]
[1273]
[1274]
[1275]
[1276]
[1277]
[1278]
[1279]
[1280]
[1281]
[1282]
[1283]
[1284]
[1285]
[1286]
[1287]
[1288]
[1289]
[1290]
[1291]
[1292]
[1293]
[1294]
[1295]
[1296]
[1297]
[1298]
[1299]
[1300]
[1301]
[1302]
[1303]
[1304]
[1305]
[1306]
[1307]
[1308]
[1309]
[1310]
[1311]
[1312]
[1313]
[1314]
[1315]
[1316]
[1317]
[1318]
[1319]
[1320]
[1321]
[1322]
[1323]
[1324]
[1325]
[1326]
[1327]
[1328]
[1329]
[1330]
[1331]
[1332]
[1333]
[1334]
[1335]
[1336]
[1337]
[1338]
[1339]
[1340]
[1341]
[1342]
[1343]
[1344]
[1345]
[1346]
[1347]
[1348]
[1349]
[1350]
[1351]
[1352]
[1353]
[1354]
[1355]
[1356]
[1357]
[1358]
[1359]
[1360]
[1361]
[1362]
[1363]
[1364]
[1365]
[1366]
[1367]
[1368]
[1369]
[1370]
[1371]
[1372]
[1373]
[1374]
[1375]
[1376]
[1377]
[1378]
[1379]
[1380]
[1381]
[1382]
[1383]
[1384]
[1385]
[1386]
[1387]
[1388]
[1389]
[1390]
[1391]
[1392]
[1393]
[1394]
[1395]
[1396]
[1397]
[1398]
[1399]
[1400]
[1401]
[1402]
[1403]
[1404]
[1405]
[1406]
[1407]
[1408]
[1409]
[1410]
[1411]
[1412]
[1413]
[1414]
[1415]
[1416]
[1417]
[1418]
[1419]
[1420]
[1421]
[1422]
[1423]
[1424]
[1425]
[1426]
[1427]
[1428]
[1429]
[1430]
[1431]
[1432]
[1433]
[1434]
[1435]
[1436]
[1437]
[1438]
[1439]
[1440]
[1441]
[1442]
[1443]
[1444]
[1445]
[1446]
[1447]
[1448]
[1449]
[1450]
[1451]
[1452]
[1453]
[1454]
[1455]
[1456]
[1457]
[1458]
[1459]
[1460]
[1461]
[1462]
[1463]
[1464]
[1465]
[1466]
[1467]
[1468]
[1469]
[1470]
[1471]
[1472]
[1473]
[1474]
[1475]
[1476]
[1477]
[1478]
[1479]
[1480]
[1481]
[1482]
[1483]
[1484]
[1485]
[1486]
[1487]
[1488]
[1489]
[1490]
[1491]
[1492]
[1493]
[1494]
[1495]
[1496]
[1497]
[1498]
[1499]
[1500]
[1501]
[1502]
[1503]
[1504]
[1505]
[1506]
[1507]
[1508]
[1509]
[1510]
[1511]
[1512]
[1513]
[1514]
[1515]
[1516]
[1517]
[1518]
[1519]
[1520]
[1521]
[1522]
[1523]
[1524]
[1525]
[1526]
[1527]
[1528]
[1529]
[1530]
[1531]
[1532]
[1533]
[1534]
[1535]
[1536]
[1537]
[1538]
[1539]
[1540]
[1541]
[1542]
[1543]
[1544]
[1545]
[1546]
[1547]
[1548]
[1549]
[1550]
[1551]
[1552]
[1553]
[1554]
[1555]
[1556]
[1557]
[1558]
[1559]
[1560]
[1561]
[1562]
[1563]
[1564]
[1565]
[1566]
[1567]
[1568]
[1569]
[1570]
[1571]
[1572]
[1573]
[1574]
[1575]
[1576]
[1577]
[1578]
[1579]
[1580]
[1581]
[1582]
[1583]
[1584]
[1585]
[1586]
[1587]
[1588]
[1589]
[1590]
[1591]
[1592]
[1593]
[1594]
[1595]
[1596]
[1597]
[1598]
[1599]
[1600]
[1601]
[1602]
[1603]
[1604]
[1605]
[1606]
[1607]
[1608]
[1609]
[1610]
[1611]
[1612]
[1613]
[1614]
[1615]
[1616]
[1617]
[1618]
[1619]
[1620]
[1621]
[1622]
[1623]
[1624]
[1625]
[1626]
[1627]
[1628]
[1629]
[1630]
[1631]
[1632]
[1633]
[1634]
[1635]
[1636]
[1637]
[1638]
[1639]
[1640]
[1641]
[1642]
[1643]
[1644]
[1645]
[1646]
[1647]
[1648]
[1649]
[1650]
[1651]
[1652]
[1653]
[1654]
[1655]
[1656]
[1657]
[1658]
[1659]
[1660]
[1661]
[1662]
[1663]
[1664]
[1665]
[1666]
[1667]
[1668]
[1669]
[1670]
[1671]
[1672]
[1673]
[1674]
[1675]
[1676]
[1677]
[1678]
[1679]
[1680]
[1681]
[1682]
[1683]
[1684]
[1685]
[1686]
[1687]
[1688]
[1689]
[1690]
[1691]
[1692]
[1693]
[1694]
[1695]
[1696]
[1697]
[1698]
[1699]
[1700]
[1701]
[1702]
[1703]
[1704]
[1705]
[1706]
[1707]
[1708]
[1709]
[1710]
[1711]
[1712]
[1713]
[1714]
[1715]
[1716]
[1717]
[1718]
[1719]
[1720]
[1721]
[1722]
[1723]
[1724]
[1725]
[1726]
[1727]
[1728]
[1729]
[1730]
[1731]
[1732]
[1733]
[1734]
[1735]
[1736]
[1737]
[1738]
[1739]
[1740]
[1741]
[1742]
[1743]
[1744]
[1745]
[1746]
[1747]
[1748]
[1749]
[1750]
[1751]
[1752]
[1753]
[1754]
[1755]
[1756]
[1757]
[1758]
[1759]
[1760]
[1761]
[1762]
[1763]
[1764]
[1765]
[1766]
[1767]
[1768]
[1769]
[1770]
[1771]
[1772]
[1773]
[1774]
[1775]
[1776]
[1777]
[1778]
[1779]
[1780]
[1781]
[1782]
[1783]
[1784]
[1785]
[1786]
[1787]
[1788]
[1789]
[1790]
[1791]
[1792]
[1793]
[1794]
[1795]
[1796]
[1797]
[1798]
[1799]
[1800]
[1801]
[1802]
[1803]
[1804]
[1805]
[1806]
[1807]
[1808]
[1809]
[1810]
[1811]
[1812]
[1813]
[1814]
[1815]
[1816]
[1817]
[1818]
[1819]
[1820]
[1821]
[1822]
[1823]
[1824]
[1825]
[1826]
[1827]
[1828]
[1829]
[1830]
[1831]
[1832]
[1833]
[1834]
[1835]
[1836]
[1837]
[1838]
[1839]
[1840]
[1841]
[1842]
[1843]
[1844]
[1845]
[1846]
[1847]
[1848]
[1849]
[1850]
[1851]
[1852]
[1853]
[1854]
[1855]
[1856]
[1857]
[1858]
[1859]
[1860]
[1861]
[1862]
[1863]
[1864]
[1865]
[1866]
[1867]
[1868]
[1869]
[1870]
[1871]
[1872]
[1873]
[1874]
[1875]
[1876]
[1877]
[1878]
[1879]
[1880]
[1881]
[1882]
[1883]
[1884]
[1885]
[1886]
[1887]
[1888]
[1889]
[1890]
[1891]
[1892]
[1893]
[1894]
[1895]
[1896]
[1897]
[1898]
[1899]
[1900]
[1901]
[1902]
[1903]
[1904]
[1905]
[1906]
[1907]
[1908]
[1909]
[1910]
[1911]
[1912]
[1913]
[1914]
[1915]
[1916]
[1917]
[1918]
[1919]
[1920]
[1921]
[1922]
[1923]
[1924]
[1925]
[1926]
[1927]
[1928]
[1929]
[1930]
[1931]
[1932]
[1933]
[1934]
[1935]
[1936]
[1937]
[1938]
[1939]
[1940]
[1941]
[1942]
[1943]
[1944]
[1945]
[1946]
[1947]
[1948]
[1949]
[1950]
[1951]
[1952]
[1953]
[1954]
[1955]
[1956]
[1957]
[1958]
[1959]
[1960]
[1961]
[1962]
[1963]
[1964]
[1965]
[1966]
[1967]
[1968]
[1969]
[1970]
[1971]
[1972]
[1973]
[1974]
[1975]
[1976]
[1977]
[1978]
[1979]
[1980]
[1981]
[1982]
[1983]
[1984]
[1985]
[1986]
[1987]
[1988]
[1989]
[1990]
[1991]
[1992]
[1993]
[1994]
[1995]
[1996]
[1997]
[1998]
[1999]
[2000]
[2001]
[2002]
[2003]
[2004]
[2005]
[2006]
[2007]
[2008]
[2009]
[2010]
[2011]
[2012]
[2013]
[2014]
[2015]
[2016]
[2017]
[2018]
[2019]
[2020]
[2021]
[2022]
[2023]
[2024]
[2025]
[2026]
[2027]
[2028]
[2029]
[2030]
[2031]
[2032]
[2033]
[2034]
[2035]
[2036]
[2037]
[2038]
[2039]
[2040]
[2041]
[2042]
[2043]
[2044]
[2045]
[2046]
[2047]
[2048]
[2049]
[2050]
[2051]
[2052]
[2053]
[2054]
[2055]
[2056]
[2057]
[2058]
[2059]
[2060]
[2061]
[2062]
[2063]
[2064]
[2065]
[2066]
[2067]
[2068]
[2069]
[2070]
[2071]
[2072]
[2073]
[2074]
[2075]
[2076]
[2077]
[2078]
[2079]
[2080]
[2081]
[2082]
[2083]
[2084]
[2085]
[2086]
[2087]
[2088]
[2089]
[2090]
[2091]
[2092]
[2093]
[2094]
[2095]
[2096]
[2097]
[2098]
[2099]
[2100]
[2101]
[2102]
[2103]
[2104]
[2105]
[2106]
[2107]
[2108]
[2109]
[2110]
[2111]
[2112]
[2113]
[2114]
[2115]
[2116]
[2117]
[2118]
[2119]
[2120]
[2121]
[2122]
[2123]
[2124]
[2125]
[2126]
[2127]
[2128]
[2129]
[2130]
[2131]
[2132]
[2133]
[2134]
[2135]
[2136]
[2137]
[2138]
[2139]
[2140]
[2141]
[2142]
[2143]
[2144]
[2145]
[2146]
[2147]
[2148]
[2149]
[2150]
[2151]
[2152]
[2153]
[2154]
[2155]
[2156]
[2157]
[2158]
[2159]
[2160]
[2161]
[2162]
[2163]
[2164]
[2165]
[2166]
[2167]
[2168]
[2169]
[2170]
[2171]
[2172]
[2173]
[2174]
[2175]
[2176]
[2177]
[2178]
[2179]
[2180]
[2181]
[2182]
[2183]
[2184]
[2185]
[2186]
[2187]
[2188]
[2189]
[2190]
[2191]
[2192]
[2193]
[2194]
[2195]
[2196]
[2197]
[2198]
[2199]
[2200]
[2201]
[2202]
[2203]
[2204]
[2205]
[2206]
[2207]
[2208]
[2209]
[2210]
[2211]
[2212]
[2213]
[2214]
[2215]
[2216]
[2217]
[2218]
[2219]
[2220]
[2221]
[2222]
[2223]
[2224]
[2225]
[2226]
[2227]
[2228]
[2229]
[2230]
[2231]
[2232]
[2233]
[2234]
[2235]
[2236]
[2237]
[2238]
[2239]
[2240]
[2241]
[2242]
[2243]
[2244]
[2245]
[2246]
[2247]
[2248]
[2249]
[2250]
[2251]
[2252]
[2253]
[2254]
[2255]
[2256]
[2257]
[2258]
[2259]
[2260]
[2261]
[2262]
[2263]
[2264]
[2265]
[2266]
[2267]
[2268]
[2269]
[2270]
[2271]
[2272]
[2273]
[2274]
[2275]
[2276]
[2277]
[2278]
[2279]
[2280]
[2281]
[2282]
[2283]
[2284]
[2285]
[2286]
[2287]
[2288]
[2289]
[2290]
[2291]
[2292]
[2293]
[2294]
[2295]
[2296]
[2297]
[2298]
[2299]
[2300]
[2301]
[2302]
[2303]
[2304]
[2305]
[2306]
[2307]
[2308]
[2309]
[2310]
[2311]
[2312]
[2313]
[2314]
[2315]
[2316]
[2317]
[2318]
[2319]
[2320]
[2321]
[2322]
[2323]
[2324]
[2325]
[2326]
[2327]
[2328]
[2329]
[2330]
[2331]
[2332]
[2333]
[2334]
[2335]
[2336]
[2337]
[2338]
[2339]
[2340]
[2341]
[2342]
[2343]
[2344]
[2345]
[2346]
[2347]
[2348]
[2349]
[2350]
[2351]
[2352]
[2353]
[2354]
[2355]
[2356]
[2357]
[2358]
[2359]
[2360]
[2361]
[2362]
[2363]
[2364]
[2365]
[2366]
[2367]
[2368]
[2369]
[2370]
[2371]
[2372]
[2373]
[2374]
[2375]
[2376]
[2377]
[2378]
[2379]
[2380]
[2381]
[2382]
[2383]
[2384]
[2385]
[2386]
[2387]
[2388]
[2389]
[2390]
[2391]
[2392]
[2393]
[2394]
[2395]
[2396]
[2397]
[2398]
[2399]
[2400]
[2401]
[2402]
[2403]
[2404]
[2405]
[2406]
[2407]
[2408]
[2409]
[2410]
[2411]
[2412]
[2413]
[2414]
[2415]
[2416]
[2417]
[2418]
[2419]
[2420]
[2421]
[2422]
[2423]
[2424]
[2425]
[2426]
[2427]
[2428]
[2429]
[2430]
[2431]
[2432]
[2433]
[2434]
[2435]
[2436]
[2437]
[2438]
[2439]
[2440]
[2441]
[2442]
[2443]
[2444]
[2445]
[2446]
[2447]
[2448]
[2449]
[2450]
[2451]
[2452]
[2453]
[2454]
[2455]
[2456]
[2457]
[2458]
[2459]
[2460]
[2461]
[2462]
[2463]
[2464]
[2465]
[2466]
[2467]
[2468]
[2469]
[2470]
[2471]
[2472]
[2473]
[2474]
[2475]
[2476]
[2477]
[2478]
[2479]
[2480]
[2481]
[2482]
[2483]
[2484]
[2485]
[2486]
[2487]
[2488]
[2489]
[2490]
[2491]
[2492]
[2493]
[2494]
[2495]
[2496]
[2497]
[2498]
[2499]
[2500]
[2501]
[2502]
[2503]
[2504]
[2505]
[2506]
[2507]
[2508]
[2509]
[2510]
[2511]
[2512]
[2513]
[2514]
[2515]
[2516]
[2517]
[2518]
[2519]
[2520]
[2521]
[2522]
[2523]
[2524]
[2525]
[2526]
[2527]
[2528]
[2529]
[2530]
[2531]
[2532]
[2533]
[2534]
[2535]
[2536]
[2537]
[2538]
[2539]
[2540]
[2541]
[2542]
[2543]
[2544]
[2545]
[2546]
[2547]
[2548]
[2549]
[2550]
[2551]
[2552]
[2553]
[2554]
[2555]
[2556]
[2557]
[2558]
[2559]
[2560]
[2561]
[2562]
[2563]
[2564]
[2565]
[2566]
[2567]
[2568]
[2569]
[2570]
[2571]
[2572]
[2573]
[2574]
[2575]
[2576]
[2577]
[2578]
[2579]
[2580]
[2581]
[2582]
[2583]
[2584]
[2585]
[2586]
[2587]
[2588]
[2589]
[2590]
[2591]
[2592]
[2593]
[2594]
[2595]
[2596]
[2597]
[2598]
[2599]
[2600]
[2601]
[2602]
[2603]
[2604]
[2605]
[2606]
[2607]
[2608]
[2609]
[2610]
[2611]
[2612]
[2613]
[2614]
[2615]
[2616]
[2617]
[2618]
[2619]
[2620]
[2621]
[2622]
[2623]
[2624]
[2625]
[2626]
[2627]
[2628]
[2629]
[2630]
[2631]
[2632]
[2633]
[2634]
[2635]
[2636]
[2637]
[2638]
[2639]
[2640]
[2641]
[2642]
[2643]
[2644]
[2645]
[2646]
[2647]
[2648]
[2649]
[2650]
[2651]
[2652]
[2653]
[2654]
[2655]
[2656]
[2657]
[2658]
[2659]
[2660]
[2661]
[2662]
[2663]
[2664]
[2665]
[2666]
[2667]
[2668]
[2669]
[2670]
[2671]
[2672]
[2673]
[2674]
[2675]
[2676]
[2677]
[2678]
[2679]
[2680]
[2681]
[2682]
[2683]
[2684]
[2685]
[2686]
[2687]
[2688]
[2689]
[2690]
[2691]
[2692]
[2693]
[2694]
[2695]
[2696]
[2697]
[2698]
[2699]
[2700]
[2701]
[2702]
[2703]
[2704]
[2705]
[2706]
[2707]
[2708]
[2709]
[2710]
[2711]
[2712]
[2713]
[2714]
[2715]
[2716]
[2717]
[2718]
[2719]
[2720]
[2721]
[2722]
[2723]
[2724]
[2725]
[2726]
[2727]
[2728]
[2729]
[2730]
[2731]
[2732]
[2733]
[2734]
[2735]
[2736]
[2737]
[2738]
[2739]
[2740]
[2741]
[2742]
[2743]
[2744]
[2745]
[2746]
[2747]
[2748]
[2749]
[2750]
[2751]
[2752]
[2753]
[2754]
[2755]
[2756]
[2757]
[2758]
[2759]
[2760]
[2761]
[2762]
[2763]
[2764]
[2765]
[2766]
[2767]
[2768]
[2769]
[2770]
[2771]
[2772]
[2773]
[2774]
[2775]
[2776]
[2777]
[2778]
[2779]
[2780]
[2781]
[2782]
[2783]
[2784]
[2785]
[2786]
[2787]
[2788]
[2789]
[2790]
[2791]
[2792]
[2793]
[2794]
[2795]
[2796]
[2797]
[2798]
[2799]
[2800]
[2801]
[2802]
[2803]
[2804]
[2805]
[2806]
[2807]
[2808]
[2809]
[2810]
[2811]
[2812]
[2813]
[2814]
[2815]
[2816]
[2817]
[2818]
[2819]
[2820]
[2821]
[2822]
[2823]
[2824]
[2825]
[2826]
[2827]
[2828]
[2829]
[2830]
[2831]
[2832]
[2833]
[2834]
[2835]
[2836]
[2837]
[2838]
[2839]
[2840]
[2841]
[2842]
[2843]
[2844]
[2845]
[2846]
[2847]
[2848]
[2849]
[2850]
[2851]
[2852]
[2853]
[2854]
[2855]
[2856]
[2857]
[2858]
[2859]
[2860]
[2861]
[2862]
[2863]
[2864]
[2865]
[2866]
[2867]
[2868]
[2869]
[2870]
[2871]
[2872]
[2873]
[2874]
[2875]
[2876]
[2877]
[2878]
[2879]
[2880]
[2881]
[2882]
[2883]
[2884]
[2885]
[2886]
[2887]
[2888]
[2889]
[2890]
[2891]
[2892]
[2893]
[2894]
[2895]
[2896]
[2897]
[2898]
[2899]
[2900]
[2901]
[2902]
[2903]
[2904]
[2905]
[2906]
[2907]
[2908]
[2909]
[2910]
[2911]
[2912]
[2913]
[2914]
[2915]
[2916]
[2917]
[2918]
[2919]
[2920]
[2921]
[2922]
[2923]
[2924]
[2925]
[2926]
[2927]
[2928]
[2929]
[2930]
[2931]
[2932]
[2933]
[2934]
[2935]
[2936]
[2937]
[2938]
[2939]
[2940]
[2941]
[2942]
[2943]
[2944]
[2945]
[2946]
[2947]
[2948]
[2949]
[2950]
[2951]
[2952]
[2953]
[2954]
[2955]
[2956]
[2957]
[2958]
[2959]
[2960]
[2961]
[2962]
[2963]
[2964]
[2965]
[2966]
[2967]
[2968]
[2969]
[2970]
[2971]
[2972]
[2973]
[2974]
[2975]
[2976]
[2977]
[2978]
[2979]
[2980]
[2981]
[2982]
[2983]
[2984]
[2985]
[2986]
[2987]
[2988]
[2989]
[2990]
[2991]
[2992]
[2993]
[2994]
[2995]
[2996]
[2997]
[2998]
[2999]
[3000]

{"sheet":"CommProjRanks","index":8,"n_rows":1001,"n_cols":91,"rows_kept":1001,"cut":false,"hidden":false,"merged":[]}
["ID#","Resource ID","Data Source","Type","Sub-Type","Resource-Specific Location","Resource Locator","Origin Zone","Intermediate Zone","Sub-Zone","State","Unbundled REC?","REC Eligible in 2020?","Available Year","Discounted Core","Capacity (MW)","Distribution System Benefits ($/kW-yr)","Capacity Factor","Annual Energy (GWh)",null,"Levelized Fuel Cost ($/MWh)",null,"Variable O&M Cost ($/MWh)","Levelized Fixed O&M Cost ($/MWh)","Levelized Capital Cost, incl. Taxes and Insurance ($/MWh)","Interconnection Cost ($/MWh)","Busbar Cost (LCOE, $/MWh)","Integration Costs ($/MWh)","Distribution System Benefits ($/MWh)",null,"Commercial Viability Score","Timing Score",null,"Capacity Value - Sale at Local Hub","Energy Value - Sale at Local Hub",null,"Ranking Cost - Sale at Local Hub","Cost Score - Sale at Local Hub",null,"Capacity Value - Sale at Local Hub, No REC","Energy Value - Sale at Local Hub, No REC",null,"Ranking Cost - Sale of Unbundled Energy","Cost Score - Sale of Unbundled Energy",null,"Environmental Ranking - Local Use",null,"Capacity Value - California","Energy Value - California",null,"Eligible for Existing Transmission?","Transmission Cost ($/MWh) - Existing Transmission",null,"Ranking Cost - Existing Transmission","Cost Score - Existing Transmission",null,"Transmission Cost ($/MWh) - New Transmission",null,"Ranking Cost - New Transmission","Cost Score - New Transmission",null,"Transmission Cost ($/MWh) - New Transmission, Intermediate Zone",null,"Ranking Cost - New Transmission, Intermediate Zone","Cost Score - New Transmission, Intermediate Zone",null,"Environmental Ranking - California Delivery",null,"Weighted Score - Local Use","Rank - Local Use",null,"MW Remaining - Local Requirements Satisfied","GWh Remaining - Local Requirements Satisfied",null,"Weighted Score - Existing Transmission","Rank - Existing Transmission",null,"MW Remaining (Original Zone) - Existing Transmission Filled","GWh Remaining (Original Zone) - Existing Transmission Filled",null,"Weighted Score - Origin Zone, New Transmission","Rank - Origin Zone, New Transmisison",null,"MW in Interim Zone - Existing Transmission Filled","GWh in Interim Zone - Existing Transmission Filled",null,"Weighted Score - New Transmission, Interim Zone","Rank - New Transmission",null,"Weighted Score - Unbundled REC","Rank - Unbundled REC"]
["CI0001"]
["CI0002"]
["CI0003"]
["CI0004"]
["CI0005"]
["CI0006"]
["CI0007"]
["CI0008"]
["CI0009"]
["CI0010"]
["CI0011"]
["CI0012"]
["CI0013"]
["CI0014"]
["CI0015"]
["CI0016"]
["CI0017"]
["CI0018"]
["CI0019"]
["CI0020"]
["CI0021"]
["CI0022"]
["CI0023"]
["CI0024"]
["CI0025"]
["CI0026"]
["CI0027"]
["CI0028"]
["CI0029"]
["CI0030"]
["CI0031"]
["CI0032"]
["CI0033"]
["CI0034"]
["CI0035"]
["CI0036"]
["CI0037"]
["CI0038"]
["CI0039"]
["CI0040"]
["CI0041"]
["CI0042"]
["CI0043"]
["CI0044"]
["CI0045"]
["CI0046"]
["CI0047"]
["CI0048"]
["CI0049"]
["CI0050"]
["CI0051"]
["CI0052"]
["CI0053"]
["CI0054"]
["CI0055"]
["CI0056"]
["CI0057"]
["CI0058"]
["CI0059"]
["CI0060"]
["CI0061"]
["CI0062"]
["CI0063"]
["CI0064"]
["CI0065"]
["CI0066"]
["CI0067"]
["CI0068"]
["CI0069"]
["CI0070"]
["CI0071"]
["CI0072"]
["CI0073"]
["CI0074"]
["CI0075"]
["CI0076"]
["CI0077"]
["CI0078"]
["CI0079"]
["CI0080"]
["CI0081"]
["CI0082"]
["CI0083"]
["CI0084"]
["CI0085"]
["CI0086"]
["CI0087"]
["CI0088"]
["CI0089"]
["CI0090"]
["CI0091"]
["CI0092"]
["CI0093"]
["CI0094"]
["CI0095"]
["CI0096"]
["CI0097"]
["CI0098"]
["CI0099"]
["CI0100"]
["CI0101"]
["CI0102"]
["CI0103"]
["CI0104"]
["CI0105"]
["CI0106"]
["CI0107"]
["CI0108"]
["CI0109"]
["CI0110"]
["CI0111"]
["CI0112"]
["CI0113"]
["CI0114"]
["CI0115"]
["CI0116"]
["CI0117"]
["CI0118"]
["CI0119"]
["CI0120"]
["CI0121"]
["CI0122"]
["CI0123"]
["CI0124"]
["CI0125"]
["CI0126"]
["CI0127"]
["CI0128"]
["CI0129"]
["CI0130"]
["CI0131"]
["CI0132"]
["CI0133"]
["CI0134"]
["CI0135"]
["CI0136"]
["CI0137"]
["CI0138"]
["CI0139"]
["CI0140"]
["CI0141"]
["CI0142"]
["CI0143"]
["CI0144"]
["CI0145"]
["CI0146"]
["CI0147"]
["CI0148"]
["CI0149"]
["CI0150"]
["CI0151"]
["CI0152"]
["CI0153"]
["CI0154"]
["CI0155"]
["CI0156"]
["CI0157"]
["CI0158"]
["CI0159"]
["CI0160"]
["CI0161"]
["CI0162"]
["CI0163"]
["CI0164"]
["CI0165"]
["CI0166"]
["CI0167"]
["CI0168"]
["CI0169"]
["CI0170"]
["CI0171"]
["CI0172"]
["CI0173"]
["CI0174"]
["CI0175"]
["CI0176"]
["CI0177"]
["CI0178"]
["CI0179"]
["CI0180"]
["CI0181"]
["CI0182"]
["CI0183"]
["CI0184"]
["CI0185"]
["CI0186"]
["CI0187"]
["CI0188"]
["CI0189"]
["CI0190"]
["CI0191"]
["CI0192"]
["CI0193"]
["CI0194"]
["CI0195"]
["CI0196"]
["CI0197"]
["CI0198"]
["CI0199"]
["CI0200"]
["CI0201"]
["CI0202"]
["CI0203"]
["CI0204"]
["CI0205"]
["CI0206"]
["CI0207"]
["CI0208"]
["CI0209"]
["CI0210"]
["CI0211"]
["CI0212"]
["CI0213"]
["CI0214"]
["CI0215"]
["CI0216"]
["CI0217"]
["CI0218"]
["CI0219"]
["CI0220"]
["CI0221"]
["CI0222"]
["CI0223"]
["CI0224"]
["CI0225"]
["CI0226"]
["CI0227"]
["CI0228"]
["CI0229"]
["CI0230"]
["CI0231"]
["CI0232"]
["CI0233"]
["CI0234"]
["CI0235"]
["CI0236"]
["CI0237"]
["CI0238"]
["CI0239"]
["CI0240"]
["CI0241"]
["CI0242"]
["CI0243"]
["CI0244"]
["CI0245"]
["CI0246"]
["CI0247"]
["CI0248"]
["CI0249"]
["CI0250"]
["CI0251"]
["CI0252"]
["CI0253"]
["CI0254"]
["CI0255"]
["CI0256"]
["CI0257"]
["CI0258"]
["CI0259"]
["CI0260"]
["CI0261"]
["CI0262"]
["CI0263"]
["CI0264"]
["CI0265"]
["CI0266"]
["CI0267"]
["CI0268"]
["CI0269"]
["CI0270"]
["CI0271"]
["CI0272"]
["CI0273"]
["CI0274"]
["CI0275"]
["CI0276"]
["CI0277"]
["CI0278"]
["CI0279"]
["CI0280"]
["CI0281"]
["CI0282"]
["CI0283"]
["CI0284"]
["CI0285"]
["CI0286"]
["CI0287"]
["CI0288"]
["CI0289"]
["CI0290"]
["CI0291"]
["CI0292"]
["CI0293"]
["CI0294"]
["CI0295"]
["CI0296"]
["CI0297"]
["CI0298"]
["CI0299"]
["CI0300"]
["CI0301"]
["CI0302"]
["CI0303"]
["CI0304"]
["CI0305"]
["CI0306"]
["CI0307"]
["CI0308"]
["CI0309"]
["CI0310"]
["CI0311"]
["CI0312"]
["CI0313"]
["CI0314"]
["CI0315"]
["CI0316"]
["CI0317"]
["CI0318"]
["CI0319"]
["CI0320"]
["CI0321"]
["CI0322"]
["CI0323"]
["CI0324"]
["CI0325"]
["CI0326"]
["CI0327"]
["CI0328"]
["CI0329"]
["CI0330"]
["CI0331"]
["CI0332"]
["CI0333"]
["CI0334"]
["CI0335"]
["CI0336"]
["CI0337"]
["CI0338"]
["CI0339"]
["CI0340"]
["CI0341"]
["CI0342"]
["CI0343"]
["CI0344"]
["CI0345"]
["CI0346"]
["CI0347"]
["CI0348"]
["CI0349"]
["CI0350"]
["CI0351"]
["CI0352"]
["CI0353"]
["CI0354"]
["CI0355"]
["CI0356"]
["CI0357"]
["CI0358"]
["CI0359"]
["CI0360"]
["CI0361"]
["CI0362"]
["CI0363"]
["CI0364"]
["CI0365"]
["CI0366"]
["CI0367"]
["CI0368"]
["CI0369"]
["CI0370"]
["CI0371"]
["CI0372"]
["CI0373"]
["CI0374"]
["CI0375"]
["CI0376"]
["CI0377"]
["CI0378"]
["CI0379"]
["CI0380"]
["CI0381"]
["CI0382"]
["CI0383"]
["CI0384"]
["CI0385"]
["CI0386"]
["CI0387"]
["CI0388"]
["CI0389"]
["CI0390"]
["CI0391"]
["CI0392"]
["CI0393"]
["CI0394"]
["CI0395"]
["CI0396"]
["CI0397"]
["CI0398"]
["CI0399"]
["CI0400"]
["CI0401"]
["CI0402"]
["CI0403"]
["CI0404"]
["CI0405"]
["CI0406"]
["CI0407"]
["CI0408"]
["CI0409"]
["CI0410"]
["CI0411"]
["CI0412"]
["CI0413"]
["CI0414"]
["CI0415"]
["CI0416"]
["CI0417"]
["CI0418"]
["CI0419"]
["CI0420"]
["CI0421"]
["CI0422"]
["CI0423"]
["CI0424"]
["CI0425"]
["CI0426"]
["CI0427"]
["CI0428"]
["CI0429"]
["CI0430"]
["CI0431"]
["CI0432"]
["CI0433"]
["CI0434"]
["CI0435"]
["CI0436"]
["CI0437"]
["CI0438"]
["CI0439"]
["CI0440"]
["CI0441"]
["CI0442"]
["CI0443"]
["CI0444"]
["CI0445"]
["CI0446"]
["CI0447"]
["CI0448"]
["CI0449"]
["CI0450"]
["CI0451"]
["CI0452"]
["CI0453"]
["CI0454"]
["CI0455"]
["CI0456"]
["CI0457"]
["CI0458"]
["CI0459"]
["CI0460"]
["CI0461"]
["CI0462"]
["CI0463"]
["CI0464"]
["CI0465"]
["CI0466"]
["CI0467"]
["CI0468"]
["CI0469"]
["CI0470"]
["CI0471"]
["CI0472"]
["CI0473"]
["CI0474"]
["CI0475"]
["CI0476"]
["CI0477"]
["CI0478"]
["CI0479"]
["CI0480"]
["CI0481"]
["CI0482"]
["CI0483"]
["CI0484"]
["CI0485"]
["CI0486"]
["CI0487"]
["CI0488"]
["CI0489"]
["CI0490"]
["CI0491"]
["CI0492"]
["CI0493"]
["CI0494"]
["CI0495"]
["CI0496"]
["CI0497"]
["CI0498"]
["CI0499"]
["CI0500"]
["CI0501"]
["CI0502"]
["CI0503"]
["CI0504"]
["CI0505"]
["CI0506"]
["CI0507"]
["CI0508"]
["CI0509"]
["CI0510"]
["CI0511"]
["CI0512"]
["CI0513"]
["CI0514"]
["CI0515"]
["CI0516"]
["CI0517"]
["CI0518"]
["CI0519"]
["CI0520"]
["CI0521"]
["CI0522"]
["CI0523"]
["CI0524"]
["CI0525"]
["CI0526"]
["CI0527"]
["CI0528"]
["CI0529"]
["CI0530"]
["CI0531"]
["CI0532"]
["CI0533"]
["CI0534"]
["CI0535"]
["CI0536"]
["CI0537"]
["CI0538"]
["CI0539"]
["CI0540"]
["CI0541"]
["CI0542"]
["CI0543"]
["CI0544"]
["CI0545"]
["CI0546"]
["CI0547"]
["CI0548"]
["CI0549"]
["CI0550"]
["CI0551"]
["CI0552"]
["CI0553"]
["CI0554"]
["CI0555"]
["CI0556"]
["CI0557"]
["CI0558"]
["CI0559"]
["CI0560"]
["CI0561"]
["CI0562"]
["CI0563"]
["CI0564"]
["CI0565"]
["CI0566"]
["CI0567"]
["CI0568"]
["CI0569"]
["CI0570"]
["CI0571"]
["CI0572"]
["CI0573"]
["CI0574"]
["CI0575"]
["CI0576"]
["CI0577"]
["CI0578"]
["CI0579"]
["CI0580"]
["CI0581"]
["CI0582"]
["CI0583"]
["CI0584"]
["CI0585"]
["CI0586"]
["CI0587"]
["CI0588"]
["CI0589"]
["CI0590"]
["CI0591"]
["CI0592"]
["CI0593"]
["CI0594"]
["CI0595"]
["CI0596"]
["CI0597"]
["CI0598"]
["CI0599"]
["CI0600"]
["CI0601"]
["CI0602"]
["CI0603"]
["CI0604"]
["CI0605"]
["CI0606"]
["CI0607"]
["CI0608"]
["CI0609"]
["CI0610"]
["CI0611"]
["CI0612"]
["CI0613"]
["CI0614"]
["CI0615"]
["CI0616"]
["CI0617"]
["CI0618"]
["CI0619"]
["CI0620"]
["CI0621"]
["CI0622"]
["CI0623"]
["CI0624"]
["CI0625"]
["CI0626"]
["CI0627"]
["CI0628"]
["CI0629"]
["CI0630"]
["CI0631"]
["CI0632"]
["CI0633"]
["CI0634"]
["CI0635"]
["CI0636"]
["CI0637"]
["CI0638"]
["CI0639"]
["CI0640"]
["CI0641"]
["CI0642"]
["CI0643"]
["CI0644"]
["CI0645"]
["CI0646"]
["CI0647"]
["CI0648"]
["CI0649"]
["CI0650"]
["CI0651"]
["CI0652"]
["CI0653"]
["CI0654"]
["CI0655"]
["CI0656"]
["CI0657"]
["CI0658"]
["CI0659"]
["CI0660"]
["CI0661"]
["CI0662"]
["CI0663"]
["CI0664"]
["CI0665"]
["CI0666"]
["CI0667"]
["CI0668"]
["CI0669"]
["CI0670"]
["CI0671"]
["CI0672"]
["CI0673"]
["CI0674"]
["CI0675"]
["CI0676"]
["CI0677"]
["CI0678"]
["CI0679"]
["CI0680"]
["CI0681"]
["CI0682"]
["CI0683"]
["CI0684"]
["CI0685"]
["CI0686"]
["CI0687"]
["CI0688"]
["CI0689"]
["CI0690"]
["CI0691"]
["CI0692"]
["CI0693"]
["CI0694"]
["CI0695"]
["CI0696"]
["CI0697"]
["CI0698"]
["CI0699"]
["CI0700"]
["CI0701"]
["CI0702"]
["CI0703"]
["CI0704"]
["CI0705"]
["CI0706"]
["CI0707"]
["CI0708"]
["CI0709"]
["CI0710"]
["CI0711"]
["CI0712"]
["CI0713"]
["CI0714"]
["CI0715"]
["CI0716"]
["CI0717"]
["CI0718"]
["CI0719"]
["CI0720"]
["CI0721"]
["CI0722"]
["CI0723"]
["CI0724"]
["CI0725"]
["CI0726"]
["CI0727"]
["CI0728"]
["CI0729"]
["CI0730"]
["CI0731"]
["CI0732"]
["CI0733"]
["CI0734"]
["CI0735"]
["CI0736"]
["CI0737"]
["CI0738"]
["CI0739"]
["CI0740"]
["CI0741"]
["CI0742"]
["CI0743"]
["CI0744"]
["CI0745"]
["CI0746"]
["CI0747"]
["CI0748"]
["CI0749"]
["CI0750"]
["CI0751"]
["CI0752"]
["CI0753"]
["CI0754"]
["CI0755"]
["CI0756"]
["CI0757"]
["CI0758"]
["CI0759"]
["CI0760"]
["CI0761"]
["CI0762"]
["CI0763"]
["CI0764"]
["CI0765"]
["CI0766"]
["CI0767"]
["CI0768"]
["CI0769"]
["CI0770"]
["CI0771"]
["CI0772"]
["CI0773"]
["CI0774"]
["CI0775"]
["CI0776"]
["CI0777"]
["CI0778"]
["CI0779"]
["CI0780"]
["CI0781"]
["CI0782"]
["CI0783"]
["CI0784"]
["CI0785"]
["CI0786"]
["CI0787"]
["CI0788"]
["CI0789"]
["CI0790"]
["CI0791"]
["CI0792"]
["CI0793"]
["CI0794"]
["CI0795"]
["CI0796"]
["CI0797"]
["CI0798"]
["CI0799"]
["CI0800"]
["CI0801"]
["CI0802"]
["CI0803"]
["CI0804"]
["CI0805"]
["CI0806"]
["CI0807"]
["CI0808"]
["CI0809"]
["CI0810"]
["CI0811"]
["CI0812"]
["CI0813"]
["CI0814"]
["CI0815"]
["CI0816"]
["CI0817"]
["CI0818"]
["CI0819"]
["CI0820"]
["CI0821"]
["CI0822"]
["CI0823"]
["CI0824"]
["CI0825"]
["CI0826"]
["CI0827"]
["CI0828"]
["CI0829"]
["CI0830"]
["CI0831"]
["CI0832"]
["CI0833"]
["CI0834"]
["CI0835"]
["CI0836"]
["CI0837"]
["CI0838"]
["CI0839"]
["CI0840"]
["CI0841"]
["CI0842"]
["CI0843"]
["CI0844"]
["CI0845"]
["CI0846"]
["CI0847"]
["CI0848"]
["CI0849"]
["CI0850"]
["CI0851"]
["CI0852"]
["CI0853"]
["CI0854"]
["CI0855"]
["CI0856"]
["CI0857"]
["CI0858"]
["CI0859"]
["CI0860"]
["CI0861"]
["CI0862"]
["CI0863"]
["CI0864"]
["CI0865"]
["CI0866"]
["CI0867"]
["CI0868"]
["CI0869"]
["CI0870"]
["CI0871"]
["CI0872"]
["CI0873"]
["CI0874"]
["CI0875"]
["CI0876"]
["CI0877"]
["CI0878"]
["CI0879"]
["CI0880"]
["CI0881"]
["CI0882"]
["CI0883"]
["CI0884"]
["CI0885"]
["CI0886"]
["CI0887"]
["CI0888"]
["CI0889"]
["CI0890"]
["CI0891"]
["CI0892"]
["CI0893"]
["CI0894"]
["CI0895"]
["CI0896"]
["CI0897"]
["CI0898"]
["CI0899"]
["CI0900"]
["CI0901"]
["CI0902"]
["CI0903"]
["CI0904"]
["CI0905"]
["CI0906"]
["CI0907"]
["CI0908"]
["CI0909"]
["CI0910"]
["CI0911"]
["CI0912"]
["CI0913"]
["CI0914"]
["CI0915"]
["CI0916"]
["CI0917"]
["CI0918"]
["CI0919"]
["CI0920"]
["CI0921"]
["CI0922"]
["CI0923"]
["CI0924"]
["CI0925"]
["CI0926"]
["CI0927"]
["CI0928"]
["CI0929"]
["CI0930"]
["CI0931"]
["CI0932"]
["CI0933"]
["CI0934"]
["CI0935"]
["CI0936"]
["CI0937"]
["CI0938"]
["CI0939"]
["CI0940"]
["CI0941"]
["CI0942"]
["CI0943"]
["CI0944"]
["CI0945"]
["CI0946"]
["CI0947"]
["CI0948"]
["CI0949"]
["CI0950"]
["CI0951"]
["CI0952"]
["CI0953"]
["CI0954"]
["CI0955"]
["CI0956"]
["CI0957"]
["CI0958"]
["CI0959"]
["CI0960"]
["CI0961"]
["CI0962"]
["CI0963"]
["CI0964"]
["CI0965"]
["CI0966"]
["CI0967"]
["CI0968"]
["CI0969"]
["CI0970"]
["CI0971"]
["CI0972"]
["CI0973"]
["CI0974"]
["CI0975"]
["CI0976"]
["CI0977"]
["CI0978"]
["CI0979"]
["CI0980"]
["CI0981"]
["CI0982"]
["CI0983"]
["CI0984"]
["CI0985"]
["CI0986"]
["CI0987"]
["CI0988"]
["CI0989"]
["CI0990"]
["CI0991"]
["CI0992"]
["CI0993"]
["CI0994"]
["CI0995"]
["CI0996"]
["CI0997"]
["CI0998"]
["CI0999"]
["CI1000"]

{"sheet":"ResourceRanks","index":9,"n_rows":3001,"n_cols":100,"rows_kept":3001,"cut":false,"hidden":false,"merged":[]}
["ID#","Resource ID","Data Source","Type","Sub-Type","Resource-Specific Location","Resource Locator","Origin Zone","Intermediate Zone","Sub-Zone","State","Out-of-State REC?","REC-Eligible","Available Year",null,"Capacity (MW)","Distribution System Benefits ($/kW-yr)","Capacity Factor","Annual Energy (GWh)",null,"Fuel Cost ($/MWh)","NOx Permit Cost ($/MWh)","Variable O&M Cost ($/MWh)","Levelized Fixed O&M Cost ($/MWh)","Levelized Capital Cost, incl. Taxes and Insurance ($/MWh)","Interconnection Cost ($/MWh)","Busbar Cost (LCOE, $/MWh)","Integration Costs ($/MWh)","Distribution System Benefits ($/MWh)",null,"Commercial Interest Score","Timing Score",null,"Capacity Value - Sale at Local Hub","Energy Value - Sale at Local Hub",null,"Ranking Cost - Sale at Local Hub","Cost Score - Sale at Local Hub",null,"Capacity Value - Sale at Local Hub, Null Energy","Energy Value - Sale at Local Hub, Null Energy",null,"Ranking Cost - Sale at Local Hub, Null Energy","Cost Score - Sale at Local Hub, Null Energy",null,"Environmental Ranking - Local Use",null,"Capacity Value - California Delivery","Energy Value - California Delivery",null,"Eligible for Existing Transmisison?","Transmission Cost ($/MWh) - Existing Transmission (Delivery to CA Load)",null,"Ranking Cost - Existing Transmission","Cost Score - Existing Transmission",null,"Transmission Cost ($/MWh) - New Transmission (Delivery to CA Load)",null,"Ranking Cost - New Transmission","Cost Score - New Transmission",null,"Transmission Cost ($/MWh) - New Transmission, Intermediate Zone",null,"Ranking Cost - New Transmission, Intermediate Zone","Cost Score - New Transmission, Intermediate Zone",null,"Environmental Ranking - California Delivery",null,"Weighted Score - Local Use","Rank - Local Use",null,"MW Remaining - Local Requirements Satisfied","GWh Remaining - Local Requirements Satisfied",null,"Weighted Score - Existing Transmission","Rank - Existing Transmisison",null,"MW Remaining - Existing Transmission Filled, Original Zone","GWh Remaining - Existing Transmission Filled, Original Zone",null,"Weighted Score - New Transmission, Original Zone","Rank - New Transmission, Original Zone",null,"MW Remaining - Existing Transmission Filled, Interim Zone","GWh Remaining - Existing Transmission Filled",null,"Weighted Score - New Transmission, Interim Zone","Rank - New Transmission, Interim Zone",null,"Weighted Score - RECs","Rank - Delivery Point"]
[1]
[2]
[3]
[4]
[5]
[6]
[7]
[8]
[9]
[10]
[11]
[12]
[13]
[14]
[15]
[16]
[17]
[18]
[19]
[20]
[21]
[22]
[23]
[24]
[25]
[26]
[27]
[28]
[29]
[30]
[31]
[32]
[33]
[34]
[35]
[36]
[37]
[38]
[39]
[40]
[41]
[42]
[43]
[44]
[45]
[46]
[47]
[48]
[49]
[50]
[51]
[52]
[53]
[54]
[55]
[56]
[57]
[58]
[59]
[60]
[61]
[62]
[63]
[64]
[65]
[66]
[67,null,null,null,null,null,null,null,null,null,null,null,null,null,null,null,null,null,null,null,null,null,null,null,null,null,null,null,null,null,null,null,null,null,null,null,null,null,null,null,null,null,null,null,null,null,null,null,null,null,null,null,null,null,null,null,null,null,null,null,null,null,null,null,null,null,null,null,null,null,null,null,null,null,null,null,null,null,null,null,null,null,null,null,null,null,null,null,null,null,null,null,null,null,{"$error":"#REF!"},{"$error":"#REF!"},{"$error":"#REF!"},{"$error":"#REF!"},{"$error":"#REF!"},{"$error":"#REF!"}]
[68,null,null,null,null,null,null,null,null,null,null,null,null,null,null,null,null,null,null,null,null,null,null,null,null,null,null,null,null,null,null,null,null,null,null,null,null,null,null,null,null,null,null,null,null,null,null,null,null,null,null,null,null,null,null,null,null,null,null,null,null,null,null,null,null,null,null,null,null,null,null,null,null,null,null,null,null,null,null,null,null,null,null,null,null,null,null,null,null,null,null,null,null,null,{"$error":"#REF!"},{"$error":"#REF!"},{"$error":"#REF!"},{"$error":"#REF!"},{"$error":"#REF!"},{"$error":"#REF!"}]
[69]
[70]
[71]
[72]
[73]
[74]
[75]
[76]
[77]
[78]
[79]
[80]
[81]
[82]
[83]
[84]
[85]
[86]
[87]
[88]
[89]
[90]
[91]
[92]
[93]
[94]
[95]
[96]
[97]
[98]
[99]
[100]
[101]
[102]
[103]
[104]
[105]
[106]
[107]
[108]
[109]
[110]
[111]
[112]
[113]
[114]
[115]
[116]
[117]
[118]
[119]
[120]
[121]
[122]
[123]
[124]
[125]
[126]
[127]
[128]
[129,null,null,null,null,null,null,null,null,null,null,null,null,null,null,null,null,null,null,null,null,null,null,null,null,null,null,null,null,null,null,null,null,null,null,null,null,null,null,null,null,null,null,null,null,null,null,null,null,null,null,null,null,null,null,null,null,null,null,null,null,null,null,null,null,null,null,null,null,null,null,null,null,null,null,null,null,null,null,null,null,null,null,null,null,null,null,null,null,null,null,null,null,null,{"$error":"#REF!"},{"$error":"#REF!"},{"$error":"#REF!"},{"$error":"#REF!"},{"$error":"#REF!"},{"$error":"#REF!"}]
[130]
[131]
[132]
[133]
[134]
[135]
[136]
[137]
[138]
[139]
[140]
[141]
[142]
[143]
[144]
[145]
[146]
[147]
[148]
[149]
[150]
[151]
[152]
[153]
[154]
[155]
[156]
[157]
[158]
[159]
[160]
[161]
[162]
[163]
[164]
[165]
[166]
[167]
[168]
[169]
[170]
[171]
[172]
[173]
[174]
[175]
[176]
[177]
[178]
[179]
[180]
[181]
[182]
[183]
[184]
[185]
[186]
[187]
[188]
[189]
[190]
[191]
[192]
[193]
[194]
[195]
[196]
[197]
[198]
[199]
[200]
[201]
[202]
[203]
[204]
[205]
[206]
[207]
[208]
[209]
[210]
[211]
[212]
[213]
[214]
[215]
[216]
[217]
[218]
[219]
[220]
[221]
[222]
[223]
[224]
[225]
[226]
[227]
[228]
[229]
[230]
[231]
[232]
[233]
[234]
[235]
[236]
[237]
[238]
[239]
[240]
[241]
[242]
[243]
[244]
[245]
[246]
[247]
[248]
[249]
[250]
[251]
[252]
[253]
[254]
[255]
[256]
[257]
[258]
[259]
[260]
[261]
[262]
[263]
[264]
[265]
[266]
[267]
[268]
[269]
[270]
[271]
[272]
[273]
[274]
[275]
[276]
[277]
[278]
[279]
[280]
[281]
[282]
[283]
[284]
[285]
[286]
[287]
[288]
[289]
[290]
[291]
[292]
[293]
[294]
[295]
[296]
[297]
[298]
[299]
[300]
[301]
[302]
[303]
[304]
[305]
[306]
[307]
[308]
[309]
[310]
[311]
[312]
[313]
[314]
[315]
[316]
[317]
[318]
[319]
[320]
[321]
[322]
[323]
[324]
[325]
[326]
[327]
[328]
[329]
[330]
[331]
[332]
[333]
[334]
[335]
[336]
[337]
[338]
[339]
[340]
[341]
[342]
[343]
[344]
[345]
[346]
[347]
[348]
[349]
[350]
[351]
[352]
[353]
[354]
[355]
[356]
[357]
[358]
[359]
[360]
[361]
[362]
[363]
[364]
[365]
[366]
[367]
[368]
[369]
[370]
[371]
[372]
[373]
[374]
[375]
[376]
[377]
[378]
[379]
[380]
[381]
[382]
[383]
[384]
[385]
[386]
[387]
[388]
[389]
[390]
[391]
[392]
[393]
[394]
[395]
[396]
[397]
[398]
[399]
[400]
[401]
[402]
[403]
[404]
[405]
[406]
[407]
[408]
[409]
[410]
[411]
[412]
[413]
[414]
[415]
[416]
[417]
[418]
[419]
[420]
[421]
[422]
[423]
[424]
[425]
[426]
[427]
[428]
[429]
[430]
[431]
[432]
[433]
[434]
[435]
[436]
[437]
[438]
[439]
[440]
[441]
[442]
[443]
[444]
[445]
[446]
[447]
[448]
[449]
[450]
[451]
[452]
[453]
[454]
[455]
[456]
[457]
[458]
[459]
[460]
[461]
[462]
[463]
[464]
[465]
[466]
[467]
[468]
[469]
[470]
[471]
[472]
[473]
[474]
[475]
[476]
[477]
[478]
[479]
[480]
[481]
[482]
[483]
[484]
[485]
[486]
[487]
[488]
[489]
[490]
[491]
[492]
[493]
[494]
[495]
[496]
[497]
[498]
[499]
[500]
[501]
[502]
[503]
[504]
[505]
[506]
[507]
[508]
[509]
[510]
[511]
[512]
[513]
[514]
[515]
[516]
[517]
[518]
[519]
[520]
[521]
[522]
[523]
[524]
[525]
[526]
[527]
[528]
[529]
[530]
[531]
[532]
[533]
[534]
[535]
[536]
[537]
[538]
[539]
[540]
[541]
[542]
[543]
[544]
[545]
[546]
[547]
[548]
[549]
[550]
[551]
[552]
[553]
[554]
[555]
[556]
[557]
[558]
[559]
[560]
[561]
[562]
[563]
[564]
[565]
[566]
[567]
[568]
[569]
[570]
[571]
[572]
[573]
[574]
[575]
[576]
[577]
[578]
[579]
[580]
[581]
[582]
[583]
[584]
[585]
[586]
[587]
[588]
[589]
[590]
[591]
[592]
[593]
[594]
[595]
[596]
[597]
[598]
[599]
[600]
[601]
[602]
[603]
[604]
[605]
[606]
[607]
[608]
[609]
[610]
[611]
[612]
[613]
[614]
[615]
[616]
[617]
[618]
[619]
[620]
[621]
[622]
[623]
[624]
[625]
[626]
[627]
[628]
[629]
[630]
[631]
[632]
[633]
[634]
[635]
[636]
[637]
[638]
[639]
[640]
[641]
[642]
[643]
[644]
[645]
[646]
[647]
[648]
[649]
[650]
[651]
[652]
[653]
[654]
[655]
[656]
[657]
[658]
[659]
[660]
[661]
[662]
[663]
[664]
[665]
[666]
[667]
[668]
[669]
[670]
[671]
[672]
[673]
[674]
[675]
[676]
[677]
[678]
[679]
[680]
[681]
[682]
[683]
[684]
[685]
[686]
[687]
[688]
[689]
[690]
[691]
[692]
[693]
[694]
[695]
[696]
[697]
[698]
[699]
[700]
[701]
[702]
[703]
[704]
[705]
[706]
[707]
[708]
[709]
[710]
[711]
[712]
[713]
[714]
[715]
[716]
[717]
[718]
[719]
[720]
[721]
[722]
[723]
[724]
[725]
[726]
[727]
[728]
[729]
[730]
[731]
[732]
[733]
[734]
[735]
[736]
[737]
[738]
[739]
[740]
[741]
[742]
[743]
[744]
[745]
[746]
[747]
[748]
[749]
[750]
[751]
[752]
[753]
[754]
[755]
[756]
[757]
[758]
[759]
[760]
[761]
[762]
[763]
[764]
[765]
[766]
[767]
[768]
[769]
[770]
[771]
[772]
[773]
[774]
[775]
[776]
[777]
[778]
[779]
[780]
[781]
[782]
[783]
[784]
[785]
[786]
[787]
[788]
[789]
[790]
[791]
[792]
[793]
[794]
[795]
[796]
[797]
[798]
[799]
[800]
[801]
[802]
[803]
[804]
[805]
[806]
[807]
[808]
[809]
[810]
[811]
[812]
[813]
[814]
[815]
[816]
[817]
[818]
[819]
[820]
[821]
[822]
[823]
[824]
[825]
[826]
[827]
[828]
[829]
[830]
[831]
[832]
[833]
[834]
[835]
[836]
[837]
[838]
[839]
[840]
[841]
[842]
[843]
[844]
[845]
[846]
[847]
[848]
[849]
[850]
[851]
[852]
[853]
[854]
[855]
[856]
[857]
[858]
[859]
[860]
[861]
[862]
[863]
[864]
[865]
[866]
[867]
[868]
[869]
[870]
[871]
[872]
[873]
[874]
[875]
[876]
[877]
[878]
[879]
[880]
[881]
[882]
[883]
[884]
[885]
[886]
[887]
[888]
[889]
[890]
[891]
[892]
[893]
[894]
[895]
[896]
[897]
[898]
[899]
[900]
[901]
[902]
[903]
[904]
[905]
[906]
[907]
[908]
[909]
[910]
[911]
[912]
[913]
[914]
[915]
[916]
[917]
[918]
[919]
[920]
[921]
[922]
[923]
[924]
[925]
[926]
[927]
[928]
[929]
[930]
[931]
[932]
[933]
[934]
[935]
[936]
[937]
[938]
[939]
[940]
[941]
[942]
[943]
[944]
[945]
[946]
[947]
[948]
[949]
[950]
[951]
[952]
[953]
[954]
[955]
[956]
[957]
[958]
[959]
[960]
[961]
[962]
[963]
[964]
[965]
[966]
[967]
[968]
[969]
[970]
[971]
[972]
[973]
[974]
[975]
[976]
[977]
[978]
[979]
[980]
[981]
[982]
[983]
[984]
[985]
[986]
[987]
[988]
[989]
[990]
[991]
[992]
[993]
[994]
[995]
[996]
[997]
[998]
[999]
[1000]
[1001]
[1002]
[1003]
[1004]
[1005]
[1006]
[1007]
[1008]
[1009]
[1010]
[1011]
[1012]
[1013]
[1014]
[1015]
[1016]
[1017]
[1018]
[1019]
[1020]
[1021]
[1022]
[1023]
[1024]
[1025]
[1026]
[1027]
[1028]
[1029]
[1030]
[1031]
[1032]
[1033]
[1034]
[1035]
[1036]
[1037]
[1038]
[1039]
[1040]
[1041]
[1042]
[1043]
[1044]
[1045]
[1046]
[1047]
[1048]
[1049]
[1050]
[1051]
[1052]
[1053]
[1054]
[1055]
[1056]
[1057]
[1058]
[1059]
[1060]
[1061]
[1062]
[1063]
[1064]
[1065]
[1066]
[1067]
[1068]
[1069]
[1070]
[1071]
[1072]
[1073]
[1074]
[1075]
[1076]
[1077]
[1078]
[1079]
[1080]
[1081]
[1082]
[1083]
[1084]
[1085]
[1086]
[1087]
[1088]
[1089]
[1090]
[1091]
[1092]
[1093]
[1094]
[1095]
[1096]
[1097]
[1098]
[1099]
[1100]
[1101]
[1102]
[1103]
[1104]
[1105]
[1106]
[1107]
[1108]
[1109]
[1110]
[1111]
[1112]
[1113]
[1114]
[1115]
[1116]
[1117]
[1118]
[1119]
[1120]
[1121]
[1122]
[1123]
[1124]
[1125]
[1126]
[1127]
[1128]
[1129]
[1130]
[1131]
[1132]
[1133]
[1134]
[1135]
[1136]
[1137]
[1138]
[1139]
[1140]
[1141]
[1142]
[1143]
[1144]
[1145]
[1146]
[1147]
[1148]
[1149]
[1150]
[1151]
[1152]
[1153]
[1154]
[1155]
[1156]
[1157]
[1158]
[1159]
[1160]
[1161]
[1162]
[1163]
[1164]
[1165]
[1166]
[1167]
[1168]
[1169]
[1170]
[1171]
[1172]
[1173]
[1174]
[1175]
[1176]
[1177]
[1178]
[1179]
[1180]
[1181]
[1182]
[1183]
[1184]
[1185]
[1186]
[1187]
[1188]
[1189]
[1190]
[1191]
[1192]
[1193]
[1194]
[1195]
[1196]
[1197]
[1198]
[1199]
[1200]
[1201]
[1202]
[1203]
[1204]
[1205]
[1206]
[1207]
[1208]
[1209]
[1210]
[1211]
[1212]
[1213]
[1214]
[1215]
[1216]
[1217]
[1218]
[1219]
[1220]
[1221]
[1222]
[1223]
[1224]
[1225]
[1226]
[1227]
[1228]
[1229]
[1230]
[1231]
[1232]
[1233]
[1234]
[1235]
[1236]
[1237]
[1238]
[1239]
[1240]
[1241]
[1242]
[1243]
[1244]
[1245]
[1246]
[1247]
[1248]
[1249]
[1250]
[1251]
[1252]
[1253]
[1254]
[1255]
[1256]
[1257]
[1258]
[1259]
[1260]
[1261]
[1262]
[1263]
[1264]
[1265]
[1266]
[1267]
[1268]
[1269]
[1270]
[1271]
[1272]
[1273]
[1274]
[1275]
[1276]
[1277]
[1278]
[1279]
[1280]
[1281]
[1282]
[1283]
[1284]
[1285]
[1286]
[1287]
[1288]
[1289]
[1290]
[1291]
[1292]
[1293]
[1294]
[1295]
[1296]
[1297]
[1298]
[1299]
[1300]
[1301]
[1302]
[1303]
[1304]
[1305]
[1306]
[1307]
[1308]
[1309]
[1310]
[1311]
[1312]
[1313]
[1314]
[1315]
[1316]
[1317]
[1318]
[1319]
[1320]
[1321]
[1322]
[1323]
[1324]
[1325]
[1326]
[1327]
[1328]
[1329]
[1330]
[1331]
[1332]
[1333]
[1334]
[1335]
[1336]
[1337]
[1338]
[1339]
[1340]
[1341]
[1342]
[1343]
[1344]
[1345]
[1346]
[1347]
[1348]
[1349]
[1350]
[1351]
[1352]
[1353]
[1354]
[1355]
[1356]
[1357]
[1358]
[1359]
[1360]
[1361]
[1362]
[1363]
[1364]
[1365]
[1366]
[1367]
[1368]
[1369]
[1370]
[1371]
[1372]
[1373]
[1374]
[1375]
[1376]
[1377]
[1378]
[1379]
[1380]
[1381]
[1382]
[1383]
[1384]
[1385]
[1386]
[1387]
[1388]
[1389]
[1390]
[1391]
[1392]
[1393]
[1394]
[1395]
[1396]
[1397]
[1398]
[1399]
[1400]
[1401]
[1402]
[1403]
[1404]
[1405]
[1406]
[1407]
[1408]
[1409]
[1410]
[1411]
[1412]
[1413]
[1414]
[1415]
[1416]
[1417]
[1418]
[1419]
[1420]
[1421]
[1422]
[1423]
[1424]
[1425]
[1426]
[1427]
[1428]
[1429]
[1430]
[1431]
[1432]
[1433]
[1434]
[1435]
[1436]
[1437]
[1438]
[1439]
[1440]
[1441]
[1442]
[1443]
[1444]
[1445]
[1446]
[1447]
[1448]
[1449]
[1450]
[1451]
[1452]
[1453]
[1454]
[1455]
[1456]
[1457]
[1458]
[1459]
[1460]
[1461]
[1462]
[1463]
[1464]
[1465]
[1466]
[1467]
[1468]
[1469]
[1470]
[1471]
[1472]
[1473]
[1474]
[1475]
[1476]
[1477]
[1478]
[1479]
[1480]
[1481]
[1482]
[1483]
[1484]
[1485]
[1486]
[1487]
[1488]
[1489]
[1490]
[1491]
[1492]
[1493]
[1494]
[1495]
[1496]
[1497]
[1498]
[1499]
[1500]
[1501]
[1502]
[1503]
[1504]
[1505]
[1506]
[1507]
[1508]
[1509]
[1510]
[1511]
[1512]
[1513]
[1514]
[1515]
[1516]
[1517]
[1518]
[1519]
[1520]
[1521]
[1522]
[1523]
[1524]
[1525]
[1526]
[1527]
[1528]
[1529]
[1530]
[1531]
[1532]
[1533]
[1534]
[1535]
[1536]
[1537]
[1538]
[1539]
[1540]
[1541]
[1542]
[1543]
[1544]
[1545]
[1546]
[1547]
[1548]
[1549]
[1550]
[1551]
[1552]
[1553]
[1554]
[1555]
[1556]
[1557]
[1558]
[1559]
[1560]
[1561]
[1562]
[1563]
[1564]
[1565]
[1566]
[1567]
[1568]
[1569]
[1570]
[1571]
[1572]
[1573]
[1574]
[1575]
[1576]
[1577]
[1578]
[1579]
[1580]
[1581]
[1582]
[1583]
[1584]
[1585]
[1586]
[1587]
[1588]
[1589]
[1590]
[1591]
[1592]
[1593]
[1594]
[1595]
[1596]
[1597]
[1598]
[1599]
[1600]
[1601]
[1602]
[1603]
[1604]
[1605]
[1606]
[1607]
[1608]
[1609]
[1610]
[1611]
[1612]
[1613]
[1614]
[1615]
[1616]
[1617]
[1618]
[1619]
[1620]
[1621]
[1622]
[1623]
[1624]
[1625]
[1626]
[1627]
[1628]
[1629]
[1630]
[1631]
[1632]
[1633]
[1634]
[1635]
[1636]
[1637]
[1638]
[1639]
[1640]
[1641]
[1642]
[1643]
[1644]
[1645]
[1646]
[1647]
[1648]
[1649]
[1650]
[1651]
[1652]
[1653]
[1654]
[1655]
[1656]
[1657]
[1658]
[1659]
[1660]
[1661]
[1662]
[1663]
[1664]
[1665]
[1666]
[1667]
[1668]
[1669]
[1670]
[1671]
[1672]
[1673]
[1674]
[1675]
[1676]
[1677]
[1678]
[1679]
[1680]
[1681]
[1682]
[1683]
[1684]
[1685]
[1686]
[1687]
[1688]
[1689]
[1690]
[1691]
[1692]
[1693]
[1694]
[1695]
[1696]
[1697]
[1698]
[1699]
[1700]
[1701]
[1702]
[1703]
[1704]
[1705]
[1706]
[1707]
[1708]
[1709]
[1710]
[1711]
[1712]
[1713]
[1714]
[1715]
[1716]
[1717]
[1718]
[1719]
[1720]
[1721]
[1722]
[1723]
[1724]
[1725]
[1726]
[1727]
[1728]
[1729]
[1730]
[1731]
[1732]
[1733]
[1734]
[1735]
[1736]
[1737]
[1738]
[1739]
[1740]
[1741]
[1742]
[1743]
[1744]
[1745]
[1746]
[1747]
[1748]
[1749]
[1750]
[1751]
[1752]
[1753]
[1754]
[1755]
[1756]
[1757]
[1758]
[1759]
[1760]
[1761]
[1762]
[1763]
[1764]
[1765]
[1766]
[1767]
[1768]
[1769]
[1770]
[1771]
[1772]
[1773]
[1774]
[1775]
[1776]
[1777]
[1778]
[1779]
[1780]
[1781]
[1782]
[1783]
[1784]
[1785]
[1786]
[1787]
[1788]
[1789]
[1790]
[1791]
[1792]
[1793]
[1794]
[1795]
[1796]
[1797]
[1798]
[1799]
[1800]
[1801]
[1802]
[1803]
[1804]
[1805]
[1806]
[1807]
[1808]
[1809]
[1810]
[1811]
[1812]
[1813]
[1814]
[1815]
[1816]
[1817]
[1818]
[1819]
[1820]
[1821]
[1822]
[1823]
[1824]
[1825]
[1826]
[1827]
[1828]
[1829]
[1830]
[1831]
[1832]
[1833]
[1834]
[1835]
[1836]
[1837]
[1838]
[1839]
[1840]
[1841]
[1842]
[1843]
[1844]
[1845]
[1846]
[1847]
[1848]
[1849]
[1850]
[1851]
[1852]
[1853]
[1854]
[1855]
[1856]
[1857]
[1858]
[1859]
[1860]
[1861]
[1862]
[1863]
[1864]
[1865]
[1866]
[1867]
[1868]
[1869]
[1870]
[1871]
[1872]
[1873]
[1874]
[1875]
[1876]
[1877]
[1878]
[1879]
[1880]
[1881]
[1882]
[1883]
[1884]
[1885]
[1886]
[1887]
[1888]
[1889]
[1890]
[1891]
[1892]
[1893]
[1894]
[1895]
[1896]
[1897]
[1898]
[1899]
[1900]
[1901]
[1902]
[1903]
[1904]
[1905]
[1906]
[1907]
[1908]
[1909]
[1910]
[1911]
[1912]
[1913]
[1914]
[1915]
[1916]
[1917]
[1918]
[1919]
[1920]
[1921]
[1922]
[1923]
[1924]
[1925]
[1926]
[1927]
[1928]
[1929]
[1930]
[1931]
[1932]
[1933]
[1934]
[1935]
[1936]
[1937]
[1938]
[1939]
[1940]
[1941]
[1942]
[1943]
[1944]
[1945]
[1946]
[1947]
[1948]
[1949]
[1950]
[1951]
[1952]
[1953]
[1954]
[1955]
[1956]
[1957]
[1958]
[1959]
[1960]
[1961]
[1962]
[1963]
[1964]
[1965]
[1966]
[1967]
[1968]
[1969]
[1970]
[1971]
[1972]
[1973]
[1974]
[1975]
[1976]
[1977]
[1978]
[1979]
[1980]
[1981]
[1982]
[1983]
[1984]
[1985]
[1986]
[1987]
[1988]
[1989]
[1990]
[1991]
[1992]
[1993]
[1994]
[1995]
[1996]
[1997]
[1998]
[1999]
[2000]
[2001]
[2002]
[2003]
[2004]
[2005]
[2006]
[2007]
[2008]
[2009]
[2010]
[2011]
[2012]
[2013]
[2014]
[2015]
[2016]
[2017]
[2018]
[2019]
[2020]
[2021]
[2022]
[2023]
[2024]
[2025]
[2026]
[2027]
[2028]
[2029]
[2030]
[2031]
[2032]
[2033]
[2034]
[2035]
[2036]
[2037]
[2038]
[2039]
[2040]
[2041]
[2042]
[2043]
[2044]
[2045]
[2046]
[2047]
[2048]
[2049]
[2050]
[2051]
[2052]
[2053]
[2054]
[2055]
[2056]
[2057]
[2058]
[2059]
[2060]
[2061]
[2062]
[2063]
[2064]
[2065]
[2066]
[2067]
[2068]
[2069]
[2070]
[2071]
[2072]
[2073]
[2074]
[2075]
[2076]
[2077]
[2078]
[2079]
[2080]
[2081]
[2082]
[2083]
[2084]
[2085]
[2086]
[2087]
[2088]
[2089]
[2090]
[2091]
[2092]
[2093]
[2094]
[2095]
[2096]
[2097]
[2098]
[2099]
[2100]
[2101]
[2102]
[2103]
[2104]
[2105]
[2106]
[2107]
[2108]
[2109]
[2110]
[2111]
[2112]
[2113]
[2114]
[2115]
[2116]
[2117]
[2118]
[2119]
[2120]
[2121]
[2122]
[2123]
[2124]
[2125]
[2126]
[2127]
[2128]
[2129]
[2130]
[2131]
[2132]
[2133]
[2134]
[2135]
[2136]
[2137]
[2138]
[2139]
[2140]
[2141]
[2142]
[2143]
[2144]
[2145]
[2146]
[2147]
[2148]
[2149]
[2150]
[2151]
[2152]
[2153]
[2154]
[2155]
[2156]
[2157]
[2158]
[2159]
[2160]
[2161]
[2162]
[2163]
[2164]
[2165]
[2166]
[2167]
[2168]
[2169]
[2170]
[2171]
[2172]
[2173]
[2174]
[2175]
[2176]
[2177]
[2178]
[2179]
[2180]
[2181]
[2182]
[2183]
[2184]
[2185]
[2186]
[2187]
[2188]
[2189]
[2190]
[2191]
[2192]
[2193]
[2194]
[2195]
[2196]
[2197]
[2198]
[2199]
[2200]
[2201]
[2202]
[2203]
[2204]
[2205]
[2206]
[2207]
[2208]
[2209]
[2210]
[2211]
[2212]
[2213]
[2214]
[2215]
[2216]
[2217]
[2218]
[2219]
[2220]
[2221]
[2222]
[2223]
[2224]
[2225]
[2226]
[2227]
[2228]
[2229]
[2230]
[2231]
[2232]
[2233]
[2234]
[2235]
[2236]
[2237]
[2238]
[2239]
[2240]
[2241]
[2242]
[2243]
[2244]
[2245]
[2246]
[2247]
[2248]
[2249]
[2250]
[2251]
[2252]
[2253]
[2254]
[2255]
[2256]
[2257]
[2258]
[2259]
[2260]
[2261]
[2262]
[2263]
[2264]
[2265]
[2266]
[2267]
[2268]
[2269]
[2270]
[2271]
[2272]
[2273]
[2274]
[2275]
[2276]
[2277]
[2278]
[2279]
[2280]
[2281]
[2282]
[2283]
[2284]
[2285]
[2286]
[2287]
[2288]
[2289]
[2290]
[2291]
[2292]
[2293]
[2294]
[2295]
[2296]
[2297]
[2298]
[2299]
[2300]
[2301]
[2302]
[2303]
[2304]
[2305]
[2306]
[2307]
[2308]
[2309]
[2310]
[2311]
[2312]
[2313]
[2314]
[2315]
[2316]
[2317]
[2318]
[2319]
[2320]
[2321]
[2322]
[2323]
[2324]
[2325]
[2326]
[2327]
[2328]
[2329]
[2330]
[2331]
[2332]
[2333]
[2334]
[2335]
[2336]
[2337]
[2338]
[2339]
[2340]
[2341]
[2342]
[2343]
[2344]
[2345]
[2346]
[2347]
[2348]
[2349]
[2350]
[2351]
[2352]
[2353]
[2354]
[2355]
[2356]
[2357]
[2358]
[2359]
[2360]
[2361]
[2362]
[2363]
[2364]
[2365]
[2366]
[2367]
[2368]
[2369]
[2370]
[2371]
[2372]
[2373]
[2374]
[2375]
[2376]
[2377]
[2378]
[2379]
[2380]
[2381]
[2382]
[2383]
[2384]
[2385]
[2386]
[2387]
[2388]
[2389]
[2390]
[2391]
[2392]
[2393]
[2394]
[2395]
[2396]
[2397]
[2398]
[2399]
[2400]
[2401]
[2402]
[2403]
[2404]
[2405]
[2406]
[2407]
[2408]
[2409]
[2410]
[2411]
[2412]
[2413]
[2414]
[2415]
[2416]
[2417]
[2418]
[2419]
[2420]
[2421]
[2422]
[2423]
[2424]
[2425]
[2426]
[2427]
[2428]
[2429]
[2430]
[2431]
[2432]
[2433]
[2434]
[2435]
[2436]
[2437]
[2438]
[2439]
[2440]
[2441]
[2442]
[2443]
[2444]
[2445]
[2446]
[2447]
[2448]
[2449]
[2450]
[2451]
[2452]
[2453]
[2454]
[2455]
[2456]
[2457]
[2458]
[2459]
[2460]
[2461]
[2462]
[2463]
[2464]
[2465]
[2466]
[2467]
[2468]
[2469]
[2470]
[2471]
[2472]
[2473]
[2474]
[2475]
[2476]
[2477]
[2478]
[2479]
[2480]
[2481]
[2482]
[2483]
[2484]
[2485]
[2486]
[2487]
[2488]
[2489]
[2490]
[2491]
[2492]
[2493]
[2494]
[2495]
[2496]
[2497]
[2498]
[2499]
[2500]
[2501]
[2502]
[2503]
[2504]
[2505]
[2506]
[2507]
[2508]
[2509]
[2510]
[2511]
[2512]
[2513]
[2514]
[2515]
[2516]
[2517]
[2518]
[2519]
[2520]
[2521]
[2522]
[2523]
[2524]
[2525]
[2526]
[2527]
[2528]
[2529]
[2530]
[2531]
[2532]
[2533]
[2534]
[2535]
[2536]
[2537]
[2538]
[2539]
[2540]
[2541]
[2542]
[2543]
[2544]
[2545]
[2546]
[2547]
[2548]
[2549]
[2550]
[2551]
[2552]
[2553]
[2554]
[2555]
[2556]
[2557]
[2558]
[2559]
[2560]
[2561]
[2562]
[2563]
[2564]
[2565]
[2566]
[2567]
[2568]
[2569]
[2570]
[2571]
[2572]
[2573]
[2574]
[2575]
[2576]
[2577]
[2578]
[2579]
[2580]
[2581]
[2582]
[2583]
[2584]
[2585]
[2586]
[2587]
[2588]
[2589]
[2590]
[2591]
[2592]
[2593]
[2594]
[2595]
[2596]
[2597]
[2598]
[2599]
[2600]
[2601]
[2602]
[2603]
[2604]
[2605]
[2606]
[2607]
[2608]
[2609]
[2610]
[2611]
[2612]
[2613]
[2614]
[2615]
[2616]
[2617]
[2618]
[2619]
[2620]
[2621]
[2622]
[2623]
[2624]
[2625]
[2626]
[2627]
[2628]
[2629]
[2630]
[2631]
[2632]
[2633]
[2634]
[2635]
[2636]
[2637]
[2638]
[2639]
[2640]
[2641]
[2642]
[2643]
[2644]
[2645]
[2646]
[2647]
[2648]
[2649]
[2650]
[2651]
[2652]
[2653]
[2654]
[2655]
[2656]
[2657]
[2658]
[2659]
[2660]
[2661]
[2662]
[2663]
[2664]
[2665]
[2666]
[2667]
[2668]
[2669]
[2670]
[2671]
[2672]
[2673]
[2674]
[2675]
[2676]
[2677]
[2678]
[2679]
[2680]
[2681]
[2682]
[2683]
[2684]
[2685]
[2686]
[2687]
[2688]
[2689]
[2690]
[2691]
[2692]
[2693]
[2694]
[2695]
[2696]
[2697]
[2698]
[2699]
[2700]
[2701]
[2702]
[2703]
[2704]
[2705]
[2706]
[2707]
[2708]
[2709]
[2710]
[2711]
[2712]
[2713]
[2714]
[2715]
[2716]
[2717]
[2718]
[2719]
[2720]
[2721]
[2722]
[2723]
[2724]
[2725]
[2726]
[2727]
[2728]
[2729]
[2730]
[2731]
[2732]
[2733]
[2734]
[2735]
[2736]
[2737]
[2738]
[2739]
[2740]
[2741]
[2742]
[2743]
[2744]
[2745]
[2746]
[2747]
[2748]
[2749]
[2750]
[2751]
[2752]
[2753]
[2754]
[2755]
[2756]
[2757]
[2758]
[2759]
[2760]
[2761]
[2762]
[2763]
[2764]
[2765]
[2766]
[2767]
[2768]
[2769]
[2770]
[2771]
[2772]
[2773]
[2774]
[2775]
[2776]
[2777]
[2778]
[2779]
[2780]
[2781]
[2782]
[2783]
[2784]
[2785]
[2786]
[2787]
[2788]
[2789]
[2790]
[2791]
[2792]
[2793]
[2794]
[2795]
[2796]
[2797]
[2798]
[2799]
[2800]
[2801]
[2802]
[2803]
[2804]
[2805]
[2806]
[2807]
[2808]
[2809]
[2810]
[2811]
[2812]
[2813]
[2814]
[2815]
[2816]
[2817]
[2818]
[2819]
[2820]
[2821]
[2822]
[2823]
[2824]
[2825]
[2826]
[2827]
[2828]
[2829]
[2830]
[2831]
[2832]
[2833]
[2834]
[2835]
[2836]
[2837]
[2838]
[2839]
[2840]
[2841]
[2842]
[2843]
[2844]
[2845]
[2846]
[2847]
[2848]
[2849]
[2850]
[2851]
[2852]
[2853]
[2854]
[2855]
[2856]
[2857]
[2858]
[2859]
[2860]
[2861]
[2862]
[2863]
[2864]
[2865]
[2866]
[2867]
[2868]
[2869]
[2870]
[2871]
[2872]
[2873]
[2874]
[2875]
[2876]
[2877]
[2878]
[2879]
[2880]
[2881]
[2882]
[2883]
[2884]
[2885]
[2886]
[2887]
[2888]
[2889]
[2890]
[2891]
[2892]
[2893]
[2894]
[2895]
[2896]
[2897]
[2898]
[2899]
[2900]
[2901]
[2902]
[2903]
[2904]
[2905]
[2906]
[2907]
[2908]
[2909]
[2910]
[2911]
[2912]
[2913]
[2914]
[2915]
[2916]
[2917]
[2918]
[2919]
[2920]
[2921]
[2922]
[2923]
[2924]
[2925]
[2926]
[2927]
[2928]
[2929]
[2930]
[2931]
[2932]
[2933]
[2934]
[2935]
[2936]
[2937]
[2938]
[2939]
[2940]
[2941]
[2942]
[2943]
[2944]
[2945]
[2946]
[2947]
[2948]
[2949]
[2950]
[2951]
[2952]
[2953]
[2954]
[2955]
[2956]
[2957]
[2958]
[2959]
[2960]
[2961]
[2962]
[2963]
[2964]
[2965]
[2966]
[2967]
[2968]
[2969]
[2970]
[2971]
[2972]
[2973]
[2974]
[2975]
[2976]
[2977]
[2978]
[2979]
[2980]
[2981]
[2982]
[2983]
[2984]
[2985]
[2986]
[2987]
[2988]
[2989]
[2990]
[2991]
[2992]
[2993]
[2994]
[2995]
[2996]
[2997]
[2998]
[2999]
[3000]