{"text_format":"1","workbook":"xlsx","n_sheets":8,"sheets":["Info","Project Components","EUL_basis","EUL_hou","NTG","NTG_by_Date","2017 EE Programs List","lookup"],"not_rendered":{"charts":0,"images":0,"macros":1,"external_links":0,"defined_names":12,"comments":0,"pivot_tables":0},"unopened":[],"bounds":{"document_bytes":16777216,"sheet_cells":100000,"rows_first":2000,"rows_last":500,"rows_between":2000,"halvings":0,"cell_chars":16384,"cell_head_chars":4096},"cells_cut":0,"cells_raw":0,"read":"whole","date_system":"1900"}

{"sheet":"Info","index":0,"n_rows":75,"n_cols":4,"rows_kept":75,"cut":false,"hidden":false,"merged":[[43,3,46,3]]}
[null,"Combining Measures for Claims"]
[null,"2018-02-23"]
[]
[null,"This workbook demonstrates a method of determing the weighted useful life, net-to-gross ratio and measure cost values of a claim when the claim represents a combination of individual measures."]
[]
[null,"The process of combining measures with differing useful life periods necessarily compromises the determination of cost effectiveness values."]
[null,"* If measures with different EUL and/or NTG values are combined into a single weighted measure, the TRC and PAC values determined by the cost-effectiveness calculator will not be"]
[null,"the same as the sum of those values when analyzed as individual measures.  The results of the weighted measures may be higher or lower than the sum of the individual measures."]
{"$rows_left_out":68}
{"sheet":"Project Components","index":1,"n_rows":45,"n_cols":48,"rows_kept":45,"cut":false,"hidden":false,"merged":[[17,34,17,35],[17,36,17,37],[35,30,35,33],[35,34,35,37],[3,42,3,45],[4,30,4,31],[4,32,4,33],[3,30,3,33],[3,34,3,37],[4,34,4,35],[4,36,4,37],[1,27,1,40],[11,2,11,4],[15,18,15,22],[4,18,4,22],[1,15,1,24],[5,2,5,3],[1,1,1,11],[36,30,36,31],[36,32,36,33],[36,34,36,35],[4,46,4,47],[25,2,25,4],[28,30,28,33],[28,34,28,37],[29,30,29,31],[29,32,29,33],[29,34,29,35],[29,36,29,37],[36,36,36,37],[16,30,16,33],[16,34,16,37],[17,30,17,31],[17,32,17,33]]}
[]
[null,"Section 1: User Input",null,null,null,null,null,null,null,null,null,null,null,null,null,"Section 2: User Input Documentation & Verification",null,null,null,null,null,null,null,null,null,null,null,"Section 3: Determination of weighted EUL, NTG and Measure Cost values"]
[]
[null,null,null,null,null,null,null,null,null,null,null,null,null,null,null,null,null,null,null,null,null,null,null,null,null,null,null,null,null,null,"First Year Savings",null,null,null,"Lifetime Savings",null,null,null,null,null,null,null,"Determination of EUL when a function of Building Type"]
[null,"Program Administrator:","PGE",null,null,null,"Program Name:",{"$f":"VLOOKUP(C6,'2017 EE Programs List'!$B$4:$D$408,2,FALSE)","v":"Residential Energy Advisor"},null,null,null,null,null,null,null,null,null,null,"NTG classification",null,null,null,null,"NTG","Measure",null,null,null,null,null," Gross",null,"Net",null," Gross",null,"Net",null,null,"kWh","therm",null,null,null,"HOU_Cat","Bldg Type","validation reference"]
[null,"Program ID:","PGE21001",null,null,null,"Main Sector:",{"$f":"VLOOKUP(C6,'2017 EE Programs List'!$B$4:$D$408,3,FALSE)","v":"Residential"},null,null,null,null,null,null,null,"Measure","NTG_ID","NTG Description","Sector","UseCategory","UseSubCategory","TechGroup","TechType","Qualifier","Delivery",null,null,"Measure","EUL/RUL","NTG","kWh","therms","kWh","therms","kWh","therms","kWh","therms","Cost","Cost","Cost",null,"HOU_Cat","HOU_Cat_LU","Basis","EUL_hou","col","num rows"]
[null,"Project ID:","PGE1234567",null,null,null,null,null,null,null,null,null,null,null,1,{"$f":"IF(ISBLANK(B14),\"\",B14)","v":"Window upgrade"},{"$f":"IF(ISBLANK(L14),\"\",L14)","v":"Res-Default>2"},{"$f":"IFERROR(VLOOKUP($L14,NTG!$B$7:$Q$106,5,FALSE),\"\")","v":"All other EEM with no evaluated NTGR; existing EEM with same delivery mechanism for more than 2 years"},{"$f":"IFERROR(VLOOKUP($L14,NTG!$B$7:$Q$106,12,FALSE),\"\")","v":"Res"},{"$f":"IFERROR(VLOOKUP($L14,NTG!$B$7:$Q$106,13,FALSE),\"\")","v":0},{"$f":"IFERROR(VLOOKUP($L14,NTG!$B$7:$Q$106,14,FALSE),\"\")","v":0},{"$f":"IFERROR(VLOOKUP($L14,NTG!$B$7:$Q$106,15,FALSE),\"\")","v":0},{"$f":"IFERROR(VLOOKUP($L14,NTG!$B$7:$Q$106,16,FALSE),\"\")","v":0},{"$f":"IFERROR(VLOOKUP($L14,NTG!$B$7:$Q$106,10,FALSE),\"\")","v":"None"},{"$f":"IFERROR(VLOOKUP($L14,NTG!$B$7:$Q$106,11,FALSE),\"\")","v":"Any"},null,null,{"$f":"+B14","v":"Window upgrade"},{"$f":"IF(ISBLANK(H14),I14,IF(AR7=\"NA\",IFERROR(VLOOKUP(H14,EUL_basis!$A$3:$I$415,7+MATCH(K14,lookup!$AB$4:$AB$5,0),FALSE),0),IFERROR(AS7/AT7,\"NotFound\")))","v":20},{"$f":"IFERROR(VLOOKUP(INDEX(NTG_by_Date!$M$4:$M$330,M14),NTG!$A$7:$I$106,VLOOKUP(G14,lookup!$Q$4:$S$6,3,FALSE),FALSE),0)","v":0.55000000000000004},{"$f":"+C14","v":200},{"$f":"+E14","v":2},{"$f":"+AE7*AD7","v":110.00000000000001},{"$f":"+AF7*AD7","v":1.1000000000000001},{"$f":"+AE7*$AC7","v":4000},40,2200.0000000000005,22,{"$f":"+F14","v":500},{"$f":"IF(G14=\"Electric\",F14,IF(G14=\"Nat'l Gas\",0,IFERROR(ROUND(AM7*(AK7*3413/elecS2S)/((AL7*100000/gasS2S)+(AK7*3413/elecS2S)),2),0)))","v":441.87},{"$f":"AM7-AN7","v":58.129999999999995},null,{"$f":"IFERROR(VLOOKUP($H14,EUL_basis!$A$3:$P$415,3,FALSE),\"\")","v":"None"},{"$f":"IF(OR(AQ7=\"None\",AQ7=\"\"),\"NA\",AQ7&J14)","v":"NA"},{"$f":"IFERROR(VLOOKUP($H14,EUL_basis!$A$3:$T$415,20,FALSE),0)","v":0},{"$f":"IFERROR(INDEX(EUL_hou!$I$4:$I$102,MATCH(AR7,EUL_hou!$L$4:$L$102,0)),0)","v":0},{"$f":"IFERROR(MATCH(AQ7,EUL_hou!$Q$4:$AA$4,0),1)","v":1},{"$f":"INDEX(EUL_hou!$Q$6:$AA$6,AU7)","v":1}]
[null,"Project Description:","Residential whole house upgrade",null,null,null,"Project Type:","Building",null,null,null,null,null,null,{"$f":"+O7+1","v":2},"Furace upgrade","Res-sAll-mHVAC-Pkg-dn",{"$f":"IFERROR(VLOOKUP($L15,NTG!$B$7:$Q$106,5,FALSE),\"\")","v":"All package HVAC AC and HP replacements with downstream incentives"},{"$f":"IFERROR(VLOOKUP($L15,NTG!$B$7:$Q$106,12,FALSE),\"\")","v":"Res"},{"$f":"IFERROR(VLOOKUP($L15,NTG!$B$7:$Q$106,13,FALSE),\"\")","v":"HVAC"},{"$f":"IFERROR(VLOOKUP($L15,NTG!$B$7:$Q$106,14,FALSE),\"\")","v":0},{"$f":"IFERROR(VLOOKUP($L15,NTG!$B$7:$Q$106,15,FALSE),\"\")","v":0},{"$f":"IFERROR(VLOOKUP($L15,NTG!$B$7:$Q$106,16,FALSE),\"\")","v":0},{"$f":"IFERROR(VLOOKUP($L15,NTG!$B$7:$Q$106,10,FALSE),\"\")","v":"Any"},{"$f":"IFERROR(VLOOKUP($L15,NTG!$B$7:$Q$106,11,FALSE),\"\")","v":"Any"},null,1,"Furace upgrade",{"$f":"IF(ISBLANK(H15),I15,IF(AR8=\"NA\",IFERROR(VLOOKUP(H15,EUL_basis!$A$3:$I$415,7+MATCH(K15,lookup!$AB$4:$AB$5,0),FALSE),0),IFERROR(AS8/AT8,\"NotFound\")))","v":20},{"$f":"IFERROR(VLOOKUP(INDEX(NTG_by_Date!$M$4:$M$330,M15),NTG!$A$7:$I$106,VLOOKUP(G15,lookup!$Q$4:$S$6,3,FALSE),FALSE),0)","v":0.6},0,20,0,{"$f":"+AF8*AD8","v":12},0,400,0,240,{"$f":"+F15","v":300},0,{"$f":"AM8-AN8","v":300},null,{"$f":"IFERROR(VLOOKUP($H15,EUL_basis!$A$3:$P$415,3,FALSE),\"\")","v":"None"},"NA",{"$f":"IFERROR(VLOOKUP($H15,EUL_basis!$A$3:$T$415,20,FALSE),0)","v":0},{"$f":"IFERROR(INDEX(EUL_hou!$I$4:$I$102,MATCH(AR8,EUL_hou!$L$4:$L$102,0)),0)","v":0},{"$f":"IFERROR(MATCH(AQ8,EUL_hou!$Q$4:$AA$4,0),1)","v":1},{"$f":"INDEX(EUL_hou!$Q$6:$AA$6,AU8)","v":1}]
{"$rows_left_out":38}
{"sheet":"EUL_basis","index":2,"n_rows":415,"n_cols":24,"rows_kept":415,"cut":false,"hidden":false,"merged":[]}
["EUL_basis table downloaded from READI:"]
[]
["EUL_ID","Description","HOU_cat","StartDate","ExpiryDate","BldgType","BldgLoc","EUL_Yrs","RUL_Yrs","Sector","Version","VersionSource","UseCategory","UseSubCategory","TechGroup","TechType","MeasType","HOU","BasisType","BasisValue","BasisDegFactor","EUL_Max_Yrs","Status","Comment"]
["Agr-DripIrr","Sprinkler to Drip/Micro Irrigation","None","2013-01-01",null,"Any","Any",20,6.7,"Ag","DEER2014","D08 v2.05","Irrigate","FarmIrrig","Irrigation",null,"Other",null,"rated years",null,null,null,"Standard"]
["Agr-GHC","Greenhouse Heat Curtain","None","2013-01-01",null,"Any","Any",5,1.7,"Ag","DEER2014","D08 v2.05","ProcHeat","EvapSepDehyd","SpaceHtg_eq",null,"Gas",null,"rated years",null,null,null,"Standard"]
["Agr-Irfilm","Infrared Film for Greenhouses","None","2013-01-01",null,"Any","Any",5,1.7,"Ag","DEER2014","D08 v2.05","BldgEnv","Fenestration","Fenest","WinFilm","GasElec",null,"rated years",null,null,null,"Standard"]
["Agr-LPSNperm","Low Pressure Sprinkler Nozzles (permanent)","None","2013-01-01",null,"Any","Any",5,1.7,"Ag","DEER2014","D08 v2.05","Irrigate","FarmIrrig","Irrigation",null,null,null,"rated years",null,null,null,"Standard"]
["Agr-LPSNport","Low Pressure Sprinkler Nozzles (portable)","None","2013-01-01",null,"Any","Any",3,1,"Ag","DEER2014","D08 v2.05","Irrigate","FarmIrrig","Irrigation",null,null,null,"rated years",null,null,null,"Standard"]
{"$rows_left_out":408}
{"sheet":"EUL_hou","index":3,"n_rows":300,"n_cols":27,"rows_kept":300,"cut":false,"hidden":false,"merged":[[2,15,2,26]]}
["EUL_hou table downloaded from READI:"]
[]
["HOU_cat","StartDate","ExpiryDate","Sector","UseCategory","UseSubCategory","BldgType","BldgLoc","HOU","Comment",null,"lookup",null,null,null,"Valid Building Types for each EUL_ID that has an hours-of-use category (HOU_cat)"]
["Com_InGen-CFL","2016-01-01",null,"Com","Lighting","InGen-CFL","Asm","Any",1160,null,null,{"$f":"A4&G4","v":"Com_InGen-CFLAsm"},null,null,null,"HOU_cat =>","None","Com_InGen-CFL","Res_InCmn-Lmp","Com_InGen-HB","Res_InCmn-Fixt","Com_InGen-LF","Com_OutGen","Res_OutCmn-Lmp","Res_OutGen-Fixt","Res_OutCmn-Fixt","Res_OutGen-LED"]
["Com_InGen-CFL","2016-01-01",null,"Com","Lighting","InGen-CFL","Com","Any",2130,null,null,"Com_InGen-CFLCom",null,null,null,"start row",1,{"$f":"MATCH(R4,$A$4:$A$102,0)","v":1},{"$f":"MATCH(S4,$A$4:$A$102,0)","v":93},31,92,61,91,96,98,95,99]
["Com_InGen-CFL","2016-01-01",null,"Com","Lighting","InGen-CFL","ECC","Any",1460,null,null,"Com_InGen-CFLECC",null,null,null,"num rows",1,{"$f":"COUNTIF($A$4:$A$102,R4)","v":30},{"$f":"COUNTIF($A$4:$A$102,S4)","v":2},30,1,30,1,2,1,1,1]
["Com_InGen-CFL","2016-01-01",null,"Com","Lighting","InGen-CFL","EPr","Any",1150,null,null,"Com_InGen-CFLEPr",null,null,null,0,"n/a",{"$f":"IF($P7<R$6,INDEX($G$4:$G$102,R$5+$P7),\"\")","v":"Asm"},"DMo","Asm","Any","Asm","Any","DMo","Any","Any","Any"]
["Com_InGen-CFL","2016-01-01",null,"Com","Lighting","InGen-CFL","ERC","Any",998,null,null,"Com_InGen-CFLERC",null,null,null,1,{"$f":"\"\"","v":""},"Com","MFm","Com","","Com","","MFm","","",""]
{"$rows_left_out":293}
{"sheet":"NTG","index":4,"n_rows":106,"n_cols":30,"rows_kept":106,"cut":false,"hidden":false,"merged":[[5,18,5,22]]}
["Ex Ante database Support Table Export"]
["Support Table Group: cpCostEff"]
["Support Table: NTG",null,null,null,null,null,null,null,null,null,null,null,null,null,null,null,null,null,null,null,null,null,null,null,null,null,"Calc Type Index:",{"$f":"MATCH('Project Components'!H9,lookup!U4:U6,0)","v":1}]
["This file created on 2/9/2018 8:42:28 PM while connected to AmazonWS-RDS as sptviewer.",null,null,null,null,null,null,null,null,null,null,null,null,null,null,null,null,null,null,null,null,null,null,null,null,null,"NTG selection table height",{"$f":"INDEX(AA6:AC6,CTind)","v":80}]
["Program/Database Description: READI v.2.4.7 (Current Ex Ante data) options: include Non-DEER data; 1/1/2013 - 12/31/2025"]
[null,null,null,null,null,null,null,null,null,null,null,null,null,null,null,null,null,null,"Date Dependency",null,null,null,null,null,null,null,{"$f":"COUNTA(AA8:AA106)","v":80},{"$f":"COUNTA(AB8:AB106)","v":19},3,80]
["Lookup","NTG","Version","StartDate","ExpiryDate","NTG_Measure_Type","NTGR_kWh","NTGR_therm","BldgType","BldgVint","NTG_Qualifier","Measure_Delivery","Sector","UseCategory","UseSubCategory","TechGroup","TechType","Documentation","before 2016","Jan2016 - Dec2016","Jan2017 - Jun2017","Jul2017 - Dec2018","after 2018",null,null,"ALL NTG","Deemed","Custom","NMEC","Current Selection"]
[{"$f":"B8&C8","v":"Agric-Default>2yrsDEER2014"},"Agric-Default>2yrs","DEER2014","2013-01-01",null,"All other EEMs with no evaluated NTGR; existing EEM in programs with same delivery mechanism for more than 2 years",0.6,0.6,"Any","Any","None","Any","Ag",null,null,null,null,"2011 DEER Update Report - Section 15 Table 15-3",true,true,true,true,true,null,null,"Agric-Default>2yrs","Agric-Default>2yrs","NonRes-sAg-mCust-ci","NonRes-sAll-mCust",{"$f":"IF(ISBLANK(INDEX(AA8:AC8,$AB$3)),\"\",INDEX(AA8:AC8,$AB$3))","v":"Agric-Default>2yrs"}]
{"$rows_left_out":99}
{"sheet":"NTG_by_Date","index":5,"n_rows":502,"n_cols":13,"rows_kept":502,"cut":false,"hidden":false,"merged":[[1,11,1,12]]}
[null,null,null,null,null,null,null,null,null,null,null,"Derived from READI NTG table"]
[null,"NTG Matrix of Date Range Applicability",null,null,null,null,null,null,null,null,null,"Sorted list of valid NTG_IDs + DateRange Index with their associated NTG lookup value"]
["NTG_ID","DEERversion",1,2,3,4,5,null,"NTG & DateRangeIndex","NTG Lookup Value",null,"NTG & DateRangeIndex","NTG Lookup Value"]
["Agric-Default>2yrs","DEER2014",{"$f":"IF(VLOOKUP($A4&$B4,NTG!$A$8:$W$106,18+C$3,FALSE),$A4&\"_\"&C$3,\"\")","v":"Agric-Default>2yrs_1"},{"$f":"IF(VLOOKUP($A4&$B4,NTG!$A$8:$W$106,18+D$3,FALSE),$A4&\"_\"&D$3,\"\")","v":"Agric-Default>2yrs_2"},{"$f":"IF(VLOOKUP($A4&$B4,NTG!$A$8:$W$106,18+E$3,FALSE),$A4&\"_\"&E$3,\"\")","v":"Agric-Default>2yrs_3"},{"$f":"IF(VLOOKUP($A4&$B4,NTG!$A$8:$W$106,18+F$3,FALSE),$A4&\"_\"&F$3,\"\")","v":"Agric-Default>2yrs_4"},{"$f":"IF(VLOOKUP($A4&$B4,NTG!$A$8:$W$106,18+G$3,FALSE),$A4&\"_\"&G$3,\"\")","v":"Agric-Default>2yrs_5"},1,{"$f":"+C4","v":"Agric-Default>2yrs_1"},{"$f":"+A4&B4","v":"Agric-Default>2yrsDEER2014"},null,"Agric-Default>2yrs_1","Agric-Default>2yrsDEER2014"]
["Agric-Sprklr-All","DEER2016",{"$f":"IF(VLOOKUP($A5&$B5,NTG!$A$8:$W$106,18+C$3,FALSE),$A5&\"_\"&C$3,\"\")","v":""},{"$f":"IF(VLOOKUP($A5&$B5,NTG!$A$8:$W$106,18+D$3,FALSE),$A5&\"_\"&D$3,\"\")","v":"Agric-Sprklr-All_2"},{"$f":"IF(VLOOKUP($A5&$B5,NTG!$A$8:$W$106,18+E$3,FALSE),$A5&\"_\"&E$3,\"\")","v":"Agric-Sprklr-All_3"},{"$f":"IF(VLOOKUP($A5&$B5,NTG!$A$8:$W$106,18+F$3,FALSE),$A5&\"_\"&F$3,\"\")","v":"Agric-Sprklr-All_4"},{"$f":"IF(VLOOKUP($A5&$B5,NTG!$A$8:$W$106,18+G$3,FALSE),$A5&\"_\"&G$3,\"\")","v":""},{"$f":"+H4+1","v":2},{"$f":"+C5","v":""},{"$f":"+A5&B5","v":"Agric-Sprklr-AllDEER2016"},null,"Agric-Default>2yrs_2","Agric-Default>2yrsDEER2014"]
["Agric-Sprklr-All","DEER2019",{"$f":"IF(VLOOKUP($A6&$B6,NTG!$A$8:$W$106,18+C$3,FALSE),$A6&\"_\"&C$3,\"\")","v":""},{"$f":"IF(VLOOKUP($A6&$B6,NTG!$A$8:$W$106,18+D$3,FALSE),$A6&\"_\"&D$3,\"\")","v":""},{"$f":"IF(VLOOKUP($A6&$B6,NTG!$A$8:$W$106,18+E$3,FALSE),$A6&\"_\"&E$3,\"\")","v":""},{"$f":"IF(VLOOKUP($A6&$B6,NTG!$A$8:$W$106,18+F$3,FALSE),$A6&\"_\"&F$3,\"\")","v":""},{"$f":"IF(VLOOKUP($A6&$B6,NTG!$A$8:$W$106,18+G$3,FALSE),$A6&\"_\"&G$3,\"\")","v":"Agric-Sprklr-All_5"},{"$f":"+H5+1","v":3},"","Agric-Sprklr-AllDEER2019",null,"Agric-Default>2yrs_3","Agric-Default>2yrsDEER2014"]
["Agricult-Default-HTR-di","DEER2014",{"$f":"IF(VLOOKUP($A7&$B7,NTG!$A$8:$W$106,18+C$3,FALSE),$A7&\"_\"&C$3,\"\")","v":"Agricult-Default-HTR-di_1"},{"$f":"IF(VLOOKUP($A7&$B7,NTG!$A$8:$W$106,18+D$3,FALSE),$A7&\"_\"&D$3,\"\")","v":"Agricult-Default-HTR-di_2"},{"$f":"IF(VLOOKUP($A7&$B7,NTG!$A$8:$W$106,18+E$3,FALSE),$A7&\"_\"&E$3,\"\")","v":"Agricult-Default-HTR-di_3"},{"$f":"IF(VLOOKUP($A7&$B7,NTG!$A$8:$W$106,18+F$3,FALSE),$A7&\"_\"&F$3,\"\")","v":"Agricult-Default-HTR-di_4"},{"$f":"IF(VLOOKUP($A7&$B7,NTG!$A$8:$W$106,18+G$3,FALSE),$A7&\"_\"&G$3,\"\")","v":"Agricult-Default-HTR-di_5"},4,"Agricult-Default-HTR-di_1","Agricult-Default-HTR-diDEER2014",null,"Agric-Default>2yrs_4","Agric-Default>2yrsDEER2014"]
["All-Default<=2yrs","DEER2014",{"$f":"IF(VLOOKUP($A8&$B8,NTG!$A$8:$W$106,18+C$3,FALSE),$A8&\"_\"&C$3,\"\")","v":"All-Default<=2yrs_1"},{"$f":"IF(VLOOKUP($A8&$B8,NTG!$A$8:$W$106,18+D$3,FALSE),$A8&\"_\"&D$3,\"\")","v":"All-Default<=2yrs_2"},{"$f":"IF(VLOOKUP($A8&$B8,NTG!$A$8:$W$106,18+E$3,FALSE),$A8&\"_\"&E$3,\"\")","v":"All-Default<=2yrs_3"},{"$f":"IF(VLOOKUP($A8&$B8,NTG!$A$8:$W$106,18+F$3,FALSE),$A8&\"_\"&F$3,\"\")","v":"All-Default<=2yrs_4"},{"$f":"IF(VLOOKUP($A8&$B8,NTG!$A$8:$W$106,18+G$3,FALSE),$A8&\"_\"&G$3,\"\")","v":"All-Default<=2yrs_5"},5,"All-Default<=2yrs_1","All-Default<=2yrsDEER2014",null,"Agric-Default>2yrs_5","Agric-Default>2yrsDEER2014"]
{"$rows_left_out":495}
{"sheet":"2017 EE Programs List","index":6,"n_rows":408,"n_cols":13,"rows_kept":408,"cut":false,"hidden":false,"merged":[]}
[null,null,null,"PA index:",{"$f":"MATCH('Project Components'!C5,'2017 EE Programs List'!F3:L3,0)","v":1}]
[null,null,null,"Rows in PA list:",{"$f":"INDEX(F2:L2,PAind)","v":105},{"$f":"COUNTA(F4:F108)","v":105},{"$f":"COUNTA(G4:G108)","v":96},94,85,4,4,17]
["PA","PrgID","ProgramName","PrimarySector","Proglist","PGE","SCE","SCG","SDGE","BAY","MCE","SCR","Current"]
["PGE","PGE21001","Residential Energy Advisor","Residential",null,"PGE21001","SCE-13-L-001","SCG3701","SDGE3201","BAYREN01","MCE01","SCR-EUC-A1",{"$f":"IF(ISBLANK(INDEX(F4:L4,$E$1)),\"\",INDEX(F4:L4,$E$1))","v":"PGE21001"}]
["PGE","PGE210010","Pay for Performance Pilot","Residential",null,"PGE210010","SCE-13-L-002A","SCG3702","SDGE3203","BAYREN02","MCE02","SCR-EUC-A2","PGE210010"]
["PGE","PGE210011","Residential Energy Fitness program","Residential",null,"PGE210011","SCE-13-L-002B","SCG3703","SDGE3204","BAYREN03","MCE03","SCR-EUC-A3","PGE210011"]
["PGE","PGE21002","Plug Load and Appliances","Residential",null,"PGE21002","SCE-13-L-002C","SCG3704","SDGE3207","BAYREN04","MCE04","SCR-EUC-A4","PGE21002"]
["PGE","PGE21003","Multifamily Energy Efficiency","Residential",null,"PGE21003","SCE-13-L-002D","SCG3705","SDGE3209",null,null,"SCR-EUC-A5","PGE21003"]
{"$rows_left_out":401}
{"sheet":"lookup","index":7,"n_rows":410,"n_cols":31,"rows_kept":410,"cut":false,"hidden":false,"merged":[]}
[]
[null,null,null,null,null,null,null,null,null,null,null,null,null,null,null,null,null,null,null,null,"Calculation"]
[null,"UseCategory","UseSubCategory","TechGroup","TechType",null,null,"UseCategory","UseSubCategory","TechGroup","TechType",null,null,null,"PA",null,"Msr Type","NTG","index",null,"Type","notes","Discount rates",null,null,"Project Type",null,"Measure Type","notes",null,"Date Range"]
[null,"AppPlug","Electronics","Electronics","AllEquip",null,null,"AppPlug","Any","AirComp","AirEcono",null,null,null,"PGE",null,"Nat'l Gas","NTGR_therm",8,null,"Deemed",null,"PGE",7.7499999999999999E-2,null,"Process",null,"ROB/NC/NR","Use EUL value associated with EUL_ID",null,"before 2016"]
[null,"AppPlug","Electronics","Electronics","AllEquip",null,null,"BldgEnv","Controls","BldgShell","AllEquip",null,null,null,"SCE",null,"Electric","NTGR_kWh",7,null,"Custom","allow EUL value","SCE",7.7600000000000002E-2,null,"Building",null,"AOE","Use RUL value associated with EUL_ID",null,"Jan2016 - Dec2016"]
[null,"AppPlug","Electronics","Electronics","AllEquip",null,null,"CompAir","Cooking","Chiller","Any",null,null,null,"SCG",null,"Both","NTGR_kWh",7,null,"NMEC","allow EUL value","SCG",7.7700000000000005E-2,null,null,null,null,null,null,"Jan2017 - Jun2017"]
[null,"AppPlug","Electronics","Electronics","DesktopComp",null,null,"ComRefrig","Diagnostic","Clean_equip","ASD",null,null,null,"SDGE",null,null,null,null,null,null,null,"SDGE",7.7800000000000008E-2,null,null,null,null,null,null,"Jul2017 - Dec2018"]
[null,"AppPlug","Electronics","Electronics","OccSensPlug",null,null,"FoodServ","Display","Cook_Equip","Boiler_Et",null,null,null,"BAY",null,null,null,null,null,null,null,"MCE",7.7900000000000011E-2,null,null,null,null,null,null,"after 2018"]
{"$rows_left_out":402}